program: Orca
programVersion: 5.0.2
elementType: Cl Cl F F F F O O C C C C C C C C C C C C C C C H H H H H H H H H H H H
charge: 0
multiplicity: 1
keywords: wb97x-d3
keywords: def2-TZVPP
keywords: def2/J RIJCOSX
keywords: DEFGRID2
keywords: scfconv7
keywords: smallprint printgap noloewdin
keywords: NOSOSCF
formula: C15H12Cl2F4O2
InChI: InChI=1/C15H12Cl2F4O2/c1-15(2)7(3-10(16)17)11(15)14(22)23-5-6-12(20)8(18)4-9(19)13(6)21/h3-4,7,11H,5H2,1-2H3
35 atoms
Cl -3.85377 -1.187074 2.153605
Cl -4.924318 1.423093 1.526889
F  4.354779 -1.33866 -0.906997
F  1.14556 2.100344 -0.94955
F  1.957596 2.877859 1.482013
F  5.195153 -0.514138 1.504624
O  0.804668 -0.144429 -2.420688
O  0.665218 -1.724592 -0.8468
C  -2.386796 -1.721958 -1.610412
C  -1.319607 -0.648743 -1.656729
C  -2.156165 -0.848906 -0.413208
C  -2.019352 -3.181456 -1.509318
C  -3.608834 -1.47044 -2.460856
C  -3.104444 0.204885 -0.010837
C  0.129435 -0.934341 -1.575322
C  -3.861181 0.15113 1.077549
C  2.218829 -0.150743 -2.321358
C  2.708007 0.337605 -0.982371
C  3.750628 -0.301756 -0.329917
C  2.131113 1.432063 -0.353537
C  2.555629 1.844071 0.896795
C  4.190908 0.124135 0.910434
C  3.591559 1.196312 1.537369
H  -1.563006 0.214756 -2.26616
H  -1.635805 -1.337562 0.404119
H  -1.76687 -3.586039 -2.491076
H  -1.178513 -3.362676 -0.845316
H  -2.873457 -3.744635 -1.130049
H  -3.833531 -0.410821 -2.57932
H  -3.473762 -1.892034 -3.457927
H  -4.48523 -1.942376 -2.014086
H  -3.191737 1.092045 -0.626257
H  2.55716 0.515865 -3.114823
H  2.617141 -1.144493 -2.526326
H  3.928688 1.52436 2.51107
totalener: -2049.14901879 hartree
nucrepener: 2264.51126631 hartree
electener: -4313.66028510 hartree
oneelecener: -7325.50477926 hartree
twoeener: 3011.84449417 hartree
kineticenergy: 2043.58845356 hartree
xcener: -143.169738619713 hartree
chargesum: 0.0000000
charge: -0.039390 -0.041873 -0.188885 -0.183339 -0.182988 -0.182939 -0.263074 -0.371958 0.114747 -0.107065 -0.012727 -0.256222 -0.228453 -0.181115 0.320999 0.033877 0.061018 -0.128316 0.251656 0.193558 0.183364 0.182981 -0.177404 0.080906 0.102456 0.086225 0.103438 0.088356 0.073899 0.093498 0.096643 0.110099 0.115164 0.121724 0.131139
qa: -0.0394 -0.0419 -0.1889 -0.1833 -0.1830 -0.1829 -0.2631 -0.3720 0.1147 -0.1071 -0.0127 -0.2562 -0.2285 -0.1811 0.3210 0.0339 0.0610 -0.1283 0.2517 0.1936 0.1834 0.1830 -0.1774 0.0809 0.1025 0.0862 0.1034 0.0884 0.0739 0.0935 0.0966 0.1101 0.1152 0.1217 0.1311
va: 1.2887 1.2650 1.1155 1.1179 1.1132 1.1122 2.1236 2.1255 3.7281 3.9133 3.8315 3.9073 3.9006 3.8659 4.2285 4.2333 3.8834 3.5900 3.9004 3.9375 3.9990 3.9898 3.8730 1.0390 1.0356 1.0025 1.0221 1.0025 1.0074 1.0048 1.0050 1.0193 0.9919 1.0155 1.0076
dispcorr: -0.017485882 hartree
energy: -2049.166504671422
dipole: -13.52207 13.52792 0.00584 -16.12701 16.31399 0.18698 -22.72939 21.75835 -0.97104
magnitude: 0.98889 au
magnitude: 2.51357 debye
