program: Orca
programVersion: 5.0.2
elementType: Cl Cl F F F F O O C C C C C C C C C C C C C C C H H H H H H H H H H H H
charge: 0
multiplicity: 1
keywords: wb97x-d3
keywords: def2-TZVPP
keywords: def2/J RIJCOSX
keywords: DEFGRID2
keywords: scfconv7
keywords: smallprint printgap noloewdin
keywords: NOSOSCF
formula: C15H12Cl2F4O2
InChI: InChI=1/C15H12Cl2F4O2/c1-15(2)7(3-10(16)17)11(15)14(22)23-5-6-12(20)8(18)4-9(19)13(6)21/h3-4,7,11H,5H2,1-2H3
35 atoms
Cl -4.772984 -2.015927 1.553959
Cl -5.610543 0.738607 1.724377
F  4.011072 -0.100794 -2.234456
F  1.987496 0.007649 2.004447
F  3.621482 2.019743 2.728316
F  5.641703 1.902988 -1.504646
O  0.774383 -0.536231 -0.837333
O  -0.277553 -2.508204 -0.823223
C  -2.577933 -0.881876 -2.198838
C  -1.510534 -0.487538 -1.201459
C  -2.860028 -0.999115 -0.729982
C  -2.462341 -2.158674 -2.995872
C  -3.188021 0.250588 -2.991205
C  -3.761149 -0.081554 -0.022457
C  -0.30992 -1.3129 -0.940564
C  -4.598425 -0.417404 0.95159
C  2.00592 -1.183592 -0.526156
C  2.961738 -0.100436 -0.128899
C  3.904504 0.407187 -1.008996
C  2.882589 0.467831 1.134869
C  3.723551 1.498853 1.509659
C  4.748666 1.439068 -0.63517
C  4.662087 1.992498 0.625169
H  -1.342504 0.579511 -1.108778
H  -2.838483 -2.014089 -0.35023
H  -2.083655 -2.99272 -2.411575
H  -3.445071 -2.436891 -3.379791
H  -1.80054 -2.020166 -3.852749
H  -3.187405 1.200363 -2.457622
H  -2.632127 0.402918 -3.917362
H  -4.220748 0.019674 -3.256894
H  -3.748606 0.964452 -0.302488
H  2.371583 -1.738346 -1.390588
H  1.87181 -1.899984 0.285424
H  5.319442 2.800309 0.916678
totalener: -2049.15292539 hartree
nucrepener: 2172.53177874 hartree
electener: -4221.68470412 hartree
oneelecener: -7141.16638684 hartree
twoeener: 2919.48168271 hartree
kineticenergy: 2043.57195306 hartree
xcener: -143.165311150033 hartree
chargesum: 0.0000000
charge: -0.039367 -0.046843 -0.185939 -0.183029 -0.180776 -0.181622 -0.258766 -0.380577 0.073190 -0.082775 0.041182 -0.248214 -0.245633 -0.202469 0.343975 0.052295 0.058870 -0.204176 0.265148 0.252617 0.178038 0.169218 -0.159116 0.075526 0.086247 0.104684 0.088293 0.085375 0.072426 0.093189 0.099182 0.095653 0.114986 0.116267 0.132938
qa: -0.0394 -0.0468 -0.1859 -0.1830 -0.1808 -0.1816 -0.2588 -0.3806 0.0732 -0.0828 0.0412 -0.2482 -0.2456 -0.2025 0.3440 0.0523 0.0589 -0.2042 0.2651 0.2526 0.1780 0.1692 -0.1591 0.0755 0.0862 0.1047 0.0883 0.0854 0.0724 0.0932 0.0992 0.0957 0.1150 0.1163 0.1329
va: 1.2882 1.2581 1.1197 1.1230 1.1143 1.1134 2.1286 2.1197 3.7524 3.8871 3.8270 3.9139 3.9111 3.9259 4.2253 4.2504 3.8402 3.7080 3.8733 3.8891 3.9985 3.9997 3.8561 1.0353 1.0501 1.0218 1.0010 1.0022 1.0100 1.0043 1.0026 1.0315 1.0082 1.0069 1.0072
dispcorr: -0.015783932 hartree
energy: -2049.168709318856
dipole: -14.39756 14.81558 0.41801 -7.94924 8.59341 0.64417 -24.95752 24.25388 -0.70365
magnitude: 1.04154 au
magnitude: 2.64739 debye
