program: Orca
programVersion: 5.0.2
elementType: Cl Cl F F F F O O C C C C C C C C C C C C C C C H H H H H H H H H H H H
charge: 0
multiplicity: 1
keywords: wb97x-d3
keywords: def2-TZVPP
keywords: def2/J RIJCOSX
keywords: DEFGRID2
keywords: scfconv7
keywords: smallprint printgap noloewdin
keywords: NOSOSCF
formula: C15H12Cl2F4O2
InChI: InChI=1/C15H12Cl2F4O2/c1-15(2)7(3-10(16)17)11(15)14(22)23-5-6-12(20)8(18)4-9(19)13(6)21/h3-4,7,11H,5H2,1-2H3
35 atoms
Cl -2.83089 0.940097 2.497461
Cl -4.666567 2.481648 0.893401
F  1.772236 1.8546 -1.466123
F  3.63114 -2.293286 -0.265595
F  4.801159 -1.155673 1.852907
F  2.922674 2.981925 0.68383
O  0.606136 -0.693395 -2.161983
O  0.392073 -1.858254 -0.267654
C  -2.634676 -1.950534 -1.003127
C  -1.545838 -0.961997 -1.35807
C  -2.412407 -0.755945 -0.125098
C  -2.303468 -3.309932 -0.435796
C  -3.81725 -1.986297 -1.942918
C  -3.332509 0.386617 -0.090954
C  -0.106206 -1.242218 -1.17044
C  -3.571361 1.157615 0.963304
C  2.014493 -0.875992 -2.123639
C  2.665128 -0.249813 -0.920881
C  2.505702 1.100995 -0.649986
C  3.443439 -0.995669 -0.049148
C  4.050164 -0.409833 1.047024
C  3.099888 1.684268 0.454138
C  3.878671 0.933089 1.310541
H  -1.764177 -0.31974 -2.203737
H  -1.907016 -0.974251 0.808655
H  -3.189098 -3.722041 0.050604
H  -2.01194 -4.000688 -1.228919
H  -1.501103 -3.283515 0.295619
H  -4.011358 -1.031955 -2.431302
H  -3.644785 -2.71968 -2.731951
H  -4.72362 -2.277906 -1.410126
H  -3.862564 0.642063 -1.000072
H  2.37791 -0.403211 -3.035434
H  2.261584 -1.936194 -2.177014
H  4.346724 1.389873 2.17176
totalener: -2049.15091246 hartree
nucrepener: 2263.17626435 hartree
electener: -4312.32717681 hartree
oneelecener: -7322.94261510 hartree
twoeener: 3010.61543829 hartree
kineticenergy: 2043.58688860 hartree
xcener: -143.170624836718 hartree
chargesum: 0.0000000
charge: -0.039795 -0.046256 -0.182498 -0.187868 -0.183838 -0.183523 -0.264134 -0.382745 0.074814 -0.083222 0.027728 -0.244154 -0.254214 -0.196132 0.354364 0.051242 0.064967 -0.172950 0.192088 0.293212 0.182359 0.182096 -0.175802 0.079607 0.088106 0.087281 0.084276 0.104899 0.074932 0.093077 0.100156 0.095033 0.120758 0.115332 0.130803
qa: -0.0398 -0.0463 -0.1825 -0.1879 -0.1838 -0.1835 -0.2641 -0.3827 0.0748 -0.0832 0.0277 -0.2442 -0.2542 -0.1961 0.3544 0.0512 0.0650 -0.1730 0.1921 0.2932 0.1824 0.1821 -0.1758 0.0796 0.0881 0.0873 0.0843 0.1049 0.0749 0.0931 0.1002 0.0950 0.1208 0.1153 0.1308
va: 1.2879 1.2586 1.1210 1.1169 1.1115 1.1118 2.1322 2.1207 3.7516 3.8416 3.8490 3.9105 3.9134 3.9230 4.2187 4.2523 3.8700 3.6249 3.9479 3.8369 3.9973 3.9894 3.8718 1.0364 1.0481 1.0006 1.0028 1.0240 1.0095 1.0042 1.0023 1.0326 0.9892 1.0187 1.0080
dispcorr: -0.016899120 hartree
energy: -2049.167811579654
dipole: -18.69053 18.51521 -0.17531 -23.37828 23.00602 -0.37226 -17.56563 16.54898 -1.01665
magnitude: 1.09676 au
magnitude: 2.78775 debye
