program: Orca
programVersion: 5.0.2
elementType: Cl Cl F F F F O O C C C C C C C C C C C C C C C H H H H H H H H H H H H
charge: 0
multiplicity: 1
keywords: wb97x-d3
keywords: def2-TZVPP
keywords: def2/J RIJCOSX
keywords: DEFGRID2
keywords: scfconv7
keywords: smallprint printgap noloewdin
keywords: NOSOSCF
formula: C15H12Cl2F4O2
InChI: InChI=1/C15H12Cl2F4O2/c1-15(2)7(3-10(16)17)11(15)14(22)23-5-6-12(20)8(18)4-9(19)13(6)21/h3-4,7,11H,5H2,1-2H3
35 atoms
Cl -1.429903 1.355701 0.761545
Cl -4.291942 1.692696 0.95009
F  4.046121 -1.196066 -0.241765
F  0.854664 1.987266 -1.575712
F  1.283279 3.35775 0.694211
F  4.505788 0.202584 1.993529
O  0.672414 -0.788512 -2.181927
O  0.905239 -2.024202 -0.334243
C  -2.104963 -2.751878 -0.783376
C  -1.278907 -1.549191 -1.195936
C  -2.012939 -1.581224 0.133275
C  -1.44524 -4.046395 -0.374842
C  -3.375814 -2.954325 -1.574342
C  -3.143187 -0.656316 0.3626
C  0.197589 -1.516913 -1.162548
C  -2.979105 0.627752 0.653091
C  2.061099 -0.48362 -2.159379
C  2.416591 0.343132 -0.953736
C  3.357888 -0.079641 -0.029176
C  1.744383 1.530117 -0.698458
C  1.975135 2.244899 0.461972
C  3.602736 0.646073 1.123053
C  2.907483 1.808707 1.381458
H  -1.720718 -0.926862 -1.965202
H  -1.353789 -1.713778 0.987377
H  -1.149269 -4.624598 -1.251584
H  -0.562277 -3.896147 0.240075
H  -2.152616 -4.6511 0.195364
H  -3.818206 -2.01639 -1.911134
H  -3.179302 -3.559288 -2.460363
H  -4.1225 -3.480376 -0.976044
H  -4.156964 -1.035697 0.3163
H  2.240049 0.072812 -3.078468
H  2.661626 -1.392295 -2.1933
H  3.089729 2.370633 2.287242
totalener: -2049.14817789 hartree
nucrepener: 2379.62743437 hartree
electener: -4428.77561226 hartree
oneelecener: -7556.01856244 hartree
twoeener: 3127.24295018 hartree
kineticenergy: 2043.59473465 hartree
xcener: -143.171028961614 hartree
chargesum: -0.0000000
charge: -0.031949 -0.041087 -0.186542 -0.176725 -0.183614 -0.183938 -0.258587 -0.383322 0.126518 -0.096196 -0.058151 -0.245914 -0.276578 -0.228098 0.336624 0.089801 0.067289 -0.154755 0.294165 0.145560 0.179797 0.182878 -0.162578 0.096156 0.114819 0.086485 0.104466 0.083956 0.084338 0.094549 0.095917 0.118096 0.120016 0.115354 0.131251
qa: -0.0319 -0.0411 -0.1865 -0.1767 -0.1836 -0.1839 -0.2586 -0.3833 0.1265 -0.0962 -0.0582 -0.2459 -0.2766 -0.2281 0.3366 0.0898 0.0673 -0.1548 0.2942 0.1456 0.1798 0.1829 -0.1626 0.0962 0.1148 0.0865 0.1045 0.0840 0.0843 0.0945 0.0959 0.1181 0.1200 0.1154 0.1313
va: 1.3202 1.2656 1.1197 1.1208 1.1078 1.1117 2.1262 2.1147 3.7346 3.8314 3.8887 3.8913 3.9167 3.8911 4.1998 4.2044 3.8690 3.6153 3.8490 3.9578 3.9435 3.9996 3.8745 1.0287 1.0252 1.0026 1.0229 1.0018 1.0011 1.0067 0.9999 1.0159 0.9916 1.0183 1.0073
dispcorr: -0.019585822 hartree
energy: -2049.167763711110
dipole: -15.99771 15.55177 -0.44593 -31.73987 31.27220 -0.46767 -11.93808 11.34162 -0.59646
magnitude: 0.87940 au
magnitude: 2.23525 debye
