program: Orca
programVersion: 5.0.2
elementType: Cl Cl F F F F O O C C C C C C C C C C C C C C C H H H H H H H H H H H H
charge: 0
multiplicity: 1
keywords: wb97x-d3
keywords: def2-TZVPP
keywords: def2/J RIJCOSX
keywords: DEFGRID2
keywords: scfconv7
keywords: smallprint printgap noloewdin
keywords: NOSOSCF
formula: C15H12Cl2F4O2
InChI: InChI=1/C15H12Cl2F4O2/c1-15(2)7(3-10(16)17)11(15)14(22)23-5-6-12(20)8(18)4-9(19)13(6)21/h3-4,7,11H,5H2,1-2H3
35 atoms
Cl -4.479096 1.605145 1.471272
Cl -6.371111 0.412986 -0.349562
F  3.306416 2.560195 -0.524845
F  2.496008 -2.030345 -1.160495
F  4.075231 -2.591768 0.929836
F  4.923228 1.983648 1.530077
O  0.690718 -0.053385 -1.983088
O  0.226613 1.068144 -0.107885
C  -1.576732 -1.558416 0.183242
C  -1.31035 -0.572696 -0.936133
C  -2.381104 -0.290297 0.089708
C  -0.598513 -1.691036 1.325264
C  -2.193073 -2.876496 -0.219301
C  -3.790794 -0.284377 -0.320321
C  -0.081432 0.253509 -0.933902
C  -4.743095 0.479575 0.201299
C  1.950876 0.595066 -2.06284
C  2.85215 0.280977 -0.898199
C  3.485145 1.287005 -0.184387
C  3.078392 -1.029264 -0.502539
C  3.89503 -1.322341 0.574043
C  4.319643 0.993126 0.879512
C  4.526059 -0.313057 1.27167
H  -1.629667 -0.899806 -1.919774
H  -2.107765 0.468606 0.813554
H  0.241425 -2.328206 1.040812
H  -0.199708 -0.734935 1.656868
H  -1.090659 -2.157173 2.180182
H  -2.789997 -3.285772 0.597299
H  -2.837452 -2.800606 -1.094209
H  -1.411866 -3.600138 -0.456243
H  -4.095131 -0.950039 -1.118494
H  1.820864 1.672983 -2.158817
H  2.392892 0.228239 -2.989041
H  5.172535 -0.540999 2.108004
totalener: -2049.15067098 hartree
nucrepener: 2251.45676678 hartree
electener: -4300.60743776 hartree
oneelecener: -7299.29271132 hartree
twoeener: 2998.68527356 hartree
kineticenergy: 2043.57961027 hartree
xcener: -143.169010846920 hartree
chargesum: 0.0000000
charge: -0.039111 -0.047989 -0.187160 -0.184858 -0.185573 -0.182530 -0.256103 -0.364518 0.073600 -0.056174 0.043206 -0.260138 -0.250944 -0.208894 0.315282 0.052684 0.054568 -0.144126 0.281068 0.170903 0.189286 0.181513 -0.174388 0.077977 0.084305 0.088541 0.099012 0.094942 0.099341 0.072259 0.096375 0.095801 0.120428 0.119562 0.131855
qa: -0.0391 -0.0480 -0.1872 -0.1849 -0.1856 -0.1825 -0.2561 -0.3645 0.0736 -0.0562 0.0432 -0.2601 -0.2509 -0.2089 0.3153 0.0527 0.0546 -0.1441 0.2811 0.1709 0.1893 0.1815 -0.1744 0.0780 0.0843 0.0885 0.0990 0.0949 0.0993 0.0723 0.0964 0.0958 0.1204 0.1196 0.1319
va: 1.2882 1.2569 1.1189 1.1147 1.1092 1.1131 2.1325 2.1404 3.7705 3.8158 3.8359 3.9095 3.9066 3.9259 4.2912 4.2478 3.8762 3.5986 3.8761 3.9203 3.9863 3.9938 3.8713 1.0340 1.0519 1.0039 1.0184 1.0042 1.0025 1.0099 1.0038 1.0311 1.0171 0.9913 1.0074
dispcorr: -0.018005842 hartree
energy: -2049.168676821533
dipole: -5.18641 5.66906 0.48265 -16.60768 15.69963 -0.90806 -3.52791 2.96586 -0.56205
magnitude: 1.17193 au
magnitude: 2.97881 debye
