program: Orca
programVersion: 5.0.2
elementType: Br Br Br Br O O O N C C C C C C C C C C C C C C C C C C C C C C H H H H H H H H H H H H H H H H H H H
charge: 0
multiplicity: 1
keywords: wb97x-d3
keywords: def2-TZVPP
keywords: def2/J RIJCOSX
keywords: DEFGRID2
keywords: scfconv7
keywords: smallprint printgap noloewdin
keywords: NOSOSCF
formula: C22H19Br4NO3
InChI: InChI=1/C22H19Br4NO3/c1-21(2)17(19(23)22(24,25)26)18(21)20(28)30-16(12-27)13-7-6-10-15(11-13)29-14-8-4-3-5-9-14/h3-11,16-19H,1-2H3
49 atoms
Br 3.536681 -1.678154 2.171717
Br 2.071557 -3.845286 -0.057475
Br 1.448511 -1.432659 -1.968724
Br 4.404678 -2.030691 -1.132615
O  -1.724033 0.758253 -0.61983
O  -1.903863 -1.124978 0.575766
O  -5.096375 4.315526 1.413631
N  -3.193895 1.88128 -3.354579
C  0.55641 0.153334 2.102657
C  0.996885 -0.943811 1.188938
C  0.118071 0.157535 0.647355
C  2.404638 -1.073052 0.688279
C  1.497211 1.268014 2.490789
C  -0.412258 -0.205635 3.201386
C  -1.255318 -0.169585 0.230271
C  2.574814 -2.033312 -0.501145
C  -3.062798 0.595121 -1.083679
C  -4.068333 1.139047 -0.099182
C  -3.120387 1.320664 -2.353189
C  -4.098522 2.502789 0.171648
C  -4.933969 0.269271 0.548232
C  -5.025364 2.990857 1.080533
C  -5.841542 0.771306 1.470404
C  -5.897055 2.129527 1.735147
C  -4.900237 5.2806 0.454442
C  -4.186097 6.408024 0.832777
C  -5.441257 5.175238 -0.821203
C  -4.012581 7.442182 -0.076534
C  -5.248769 6.212002 -1.723127
C  -4.536095 7.347125 -1.358533
H  0.490519 -1.88766 1.364862
H  0.601716 0.918624 0.045956
H  2.802364 -0.099618 0.387815
H  2.087769 0.987787 3.363384
H  2.183237 1.551986 1.693264
H  0.921804 2.156823 2.753492
H  -1.065313 0.637282 3.431911
H  -1.03539 -1.064505 2.963195
H  0.145283 -0.4493 4.106978
H  -3.278997 -0.455102 -1.302548
H  -3.411378 3.177708 -0.326073
H  -4.904012 -0.79039 0.331995
H  -6.519856 0.100539 1.980064
H  -6.612875 2.524434 2.444606
H  -3.775973 6.477402 1.832248
H  -6.009627 4.301643 -1.114602
H  -3.458224 8.322587 0.221021
H  -5.667415 6.130594 -2.717654
H  -4.393918 8.151931 -2.067163
elementType: Br O N C H
nucrepener: 5479.34416314 hartree
twoeener: 9883.06653595 hartree
cpcmener: -0.03489715 hartree
xcener: -389.798438256819 hartree
chargesum: 0.0000000
charge: -0.082875 -0.013667 -0.012652 -0.001979 -0.277278 -0.460383 -0.338883 -0.100922 0.094137 -0.089216 -0.150808 -0.157387 -0.261699 -0.265492 0.416705 0.038325 0.431647 0.012872 -0.225728 -0.197259 -0.189501 0.241318 -0.123448 -0.229019 0.286644 -0.252803 -0.190788 -0.123349 -0.146613 -0.189807 0.118860 0.120520 0.171078 0.098550 0.093468 0.109506 0.106228 0.094544 0.099786 0.142328 0.148509 0.149177 0.162492 0.151245 0.149146 0.158453 0.161753 0.162675 0.161592
qa: -0.0829 -0.0137 -0.0127 -0.0020 -0.2773 -0.4604 -0.3389 -0.1009 0.0941 -0.0892 -0.1508 -0.1574 -0.2617 -0.2655 0.4167 0.0383 0.4316 0.0129 -0.2257 -0.1973 -0.1895 0.2413 -0.1234 -0.2290 0.2866 -0.2528 -0.1908 -0.1233 -0.1466 -0.1898 0.1189 0.1205 0.1711 0.0985 0.0935 0.1095 0.1062 0.0945 0.0998 0.1423 0.1485 0.1492 0.1625 0.1512 0.1491 0.1585 0.1618 0.1627 0.1616
va: 1.1820 1.2221 1.2276 1.2299 2.1311 2.0510 2.0676 3.1081 3.8710 3.7320 3.8901 4.0646 3.9008 3.9012 4.1252 4.3490 3.7138 3.6006 4.0776 3.9686 3.9413 3.7621 3.9058 4.0106 3.6785 4.0082 3.8999 3.8781 3.8851 3.9003 1.0444 1.0245 0.9915 1.0056 1.0041 1.0027 0.9989 1.0175 1.0026 1.0155 1.0106 1.0083 0.9883 1.0036 1.0071 0.9964 0.9878 0.9891 0.9892
dispcorr: -0.029153563 hartree
energy: -11427.159307069716
dipole: -145.08612 144.90504 -0.18108 120.93095 -120.17454 0.75641 27.98698 -26.59271 1.39428
magnitude: 1.59654 au
magnitude: 4.05809 debye
