program: Gaussian 09
title: 000073273
version: EM64L-G09RevD.01
frameworkgroup: C1[X(C5H5ClN2O2)]
method: RPBEPBE
basis: SDD
operation: Freq
keyword: #p
keyword: freq=noraman
keyword: PBEPBE/SDD
title: #p freq=noraman PBEPBE/SDD
converged: YES YES NO NO
title: Mulliken charges:
elementType: Cl O O N N C C C C C H H H H H
charge: -0.036040 -0.234393 -0.234271 -0.394589 -0.386632 0.493395 -0.396963 -0.722698 0.145432 0.189108 0.355646 0.265687 0.291171 0.297648 0.367500
chargesum: 0.00000
title: Mulliken charges with hydrogens summed into heavy atoms:
elementType: Cl O O N N C C C C C
charge: -0.036040 -0.234393 -0.234271 -0.038943 -0.019133 0.493395 -0.131276 -0.133880 0.145432 0.189108
polarizability: 1.11284863e+02 1.21168131e+01 9.67527938e+01 2.23060011e+00 -1.61327489e+00 4.32966838e+01
1716.lowfreq: -8.3356 -0.6882 -0.0011 0.0003 0.0016 6.7082 42.9102 106.7977 162.6319
frequency: 42.8781 106.7962 162.6295 177.4779 227.4060 278.0049 360.3760 483.3029 506.3303 539.8039 553.5580 635.2427 641.8800 673.6444 702.8496 718.8725 774.0692 827.3748 907.1238 928.2917 983.6603 1018.1674 1136.8994 1177.4966 1209.8407 1263.4140 1313.7347 1349.9902 1375.0635 1441.8070 1474.2790 1609.1151 1660.4618 1682.8838 3061.5669 3158.7833 3208.8585 3526.6478 3528.0795
redmass: 6.2696 11.2975 7.7678 5.3373 3.9336 5.4769 11.8662 5.8496 7.8500 4.0233 7.6602 5.9149 1.6722 2.9901 2.2220 2.4529 1.9849 1.6160 1.7154 4.7302 2.7939 4.1890 1.1734 2.3132 2.8326 1.2653 1.9608 2.1371 1.9372 1.1396 2.9656 7.2776 6.7446 5.6831 1.0606 1.1069 1.0945 1.0766 1.0785
irintensity: 5.6875 2.9635 3.7441 1.0442 1.4199 2.1551 23.9826 3.1912 11.5420 0.7952 10.4555 19.0604 38.0709 23.9139 83.3888 9.4533 129.6154 56.8117 7.1853 13.5769 9.6166 10.2681 13.0241 8.5074 22.3570 46.0804 70.8122 56.3502 58.4456 23.4814 55.6163 52.0129 408.0509 661.7795 5.7359 2.0811 1.4475 95.9031 61.4448
temp: 298.150 k
press: 1.00000 atm
elementType: 17 8 8 7 7 6 6 6 6 6 1 1 1 1 1
symmnumber: 1
zpe: 271723.7 jmol-1
zpe.correction: 0.103494 hartree
zpe.thermalcorrener: 0.112343 hartree
zpe.thermalcorrenthalpy: 0.113287 hartree
zpe.thermalcorrgfe: 0.068225 hartree
zpe.sumelectzpe: -912.847624 hartree
zpe.sumelectthermal: -912.838775 hartree
zpe.sumelectthermalent: -912.837831 hartree
zpe.sumelectthermalfe: -912.882893 hartree
dipole: 3.2716 -1.3462 1.8360
dipole: 3.9858
quadrupole: -73.2116 -74.3259 -63.6565
quadrupole: -6.2060 2.8251 -2.0495
quadrupole: -2.8136 -3.9279 6.7415 -6.2060 2.8251 -2.0495
hfenergy: -912.9511182 hartree
pointgroup: C01 [X(C5H5Cl1N2O2)]
dipole: -1.3769229 -0.0834173 -0.7457638 debye
dipolederiv: -0.4857757 0.1043383 0.0706794 0.2059941 -0.2546851 -0.0899502 0.2849733 -0.1314355 -0.2553243 -0.660123 -0.3376608 -0.0773542 -0.3650078 -1.1738751 -0.1376137 -0.0952108 -0.1609155 -0.4138722 -0.8402505 0.4829966 0.0001746 0.2881249 -0.9654317 -0.0280609 -0.0251887 0.0020201 -0.3729461 -0.9367037 -0.6622172 -0.1643068 0.0300967 -0.8970025 -0.0410075 -0.1611382 -0.1008248 -0.3310065 -0.4084358 0.057424 0.0102313 -0.016217 -1.3035908 -0.0998255 -0.0007257 -0.1068241 -0.3620111 0.2259819 0.1792038 0.0591151 -0.086561 1.0291017 0.0005798 0.1245387 0.0614289 0.0138785 -0.7643941 0.4388198 0.000777 0.0600662 -0.3093158 0.0238695 -0.0573702 0.032854 -0.2034519 0.6012913 -0.295898 -0.1846846 -0.2651039 0.2635104 0.149931 -0.4017449 0.1947067 0.3567095 1.337491 0.4501724 0.2053384 0.2865085 1.7069167 0.1925484 0.2065339 0.2586238 0.3930121 1.3414993 -0.4407392 0.0769425 -0.0945695 1.4602537 0.1037287 0.0951558 0.0857731 0.315054 0.2632315 -0.0235188 -0.0277729 -0.0316483 0.2549198 -0.0281742 -0.0203193 -0.0614068 0.3165614 0.0481221 -0.0381792 -0.0262668 -0.0625715 0.0560044 -0.0180292 -0.0098018 -0.0268428 0.1723093 0.0475898 0.0300008 0.0479681 -0.0436676 -0.050307 -0.0462121 0.0397891 -0.0319906 0.0743834 -0.0075986 0.05875 0.0291613 0.0891809 0.0357881 0.0412133 0.0373756 0.0087143 -0.0427971 0.2380746 -0.0034923 -0.0200024 0.0053752 0.1477133 -0.0229976 -0.0168667 -0.0238807 0.3395011 unknown
polarizability: 104.9365511|-14.3075378|100.9482232|-0.0368724|11.2142054|45.4495658 unknown
InChI: InChI=1S/C5H5ClN2O2/c6-2-3-1-4(9)8-5(10)7-3/h1,7-8H,2H2
charge 0 multiplicity 1
15 atoms
Cl -3.438658 0.877764 0.601645
O  1.503583 2.410996 0.399628
O  2.010642 -2.226005 -0.083103
N  -0.379241 1.103806 -0.089232
N  1.728995 0.085595 0.129282
C  -0.97406 -0.135303 -0.323913
C  -0.218901 -1.286503 -0.324876
C  -2.438749 -0.135987 -0.656896
C  0.997897 1.284119 0.167606
C  1.229201 -1.234489 -0.095337
H  -0.962188 1.9400 0.010255
H  -0.66406 -2.265926 -0.502444
H  -2.855748 -1.150247 -0.637352
H  -2.646674 0.353381 -1.62131
H  2.735761 0.171699 0.302447
