program: Orca
programVersion: 5.0.2
elementType: Br Br Br Br O O O N C C C C C C C C C C C C C C C C C C C C C C H H H H H H H H H H H H H H H H H H H
charge: 0
multiplicity: 1
keywords: wb97x-d3
keywords: def2-TZVPP
keywords: def2/J RIJCOSX
keywords: DEFGRID2
keywords: scfconv7
keywords: smallprint printgap noloewdin
keywords: NOSOSCF
formula: C22H19Br4NO3
InChI: InChI=1/C22H19Br4NO3/c1-21(2)17(19(23)22(24,25)26)18(21)20(28)30-16(12-27)13-7-6-10-15(11-13)29-14-8-4-3-5-9-14/h3-11,16-19H,1-2H3
49 atoms
Br 3.463582 -1.829821 -1.449698
Br 3.207386 0.960267 0.571642
Br 1.463461 -0.7046 2.583207
Br 4.349736 -1.661858 1.868405
O  -2.532549 -1.06021 0.863584
O  -1.458623 0.592087 -0.191271
O  -5.572287 2.840584 -2.324229
N  -5.244616 -1.396417 2.724498
C  -0.02738 -1.991356 -1.418608
C  0.882393 -1.150796 -0.577977
C  -0.4498 -1.574011 -0.018357
C  2.157454 -1.680489 0.008201
C  0.224013 -3.46824 -1.602078
C  -0.650844 -1.346789 -2.631021
C  -1.489046 -0.550518 0.189874
C  2.758911 -0.830115 1.140221
C  -3.656258 -0.201309 1.028518
C  -4.379452 0.044872 -0.27494
C  -4.528344 -0.886581 1.98279
C  -4.64528 1.350182 -0.658439
C  -4.7435 -1.025424 -1.082935
C  -5.2600 1.586401 -1.8813
C  -5.374463 -0.773423 -2.291033
C  -5.626344 0.527331 -2.700411
C  -4.798552 3.925858 -1.99043
C  -3.410611 3.871355 -1.945525
C  -5.46984 5.117753 -1.758986
C  -2.699623 5.025368 -1.647685
C  -4.744126 6.266231 -1.47714
C  -3.358413 6.224597 -1.412078
H  0.933003 -0.114238 -0.896046
H  -0.463895 -2.387875 0.697986
H  2.021358 -2.692562 0.398838
H  0.629516 -3.951655 -0.713455
H  -0.713967 -3.971894 -1.840689
H  0.911114 -3.643918 -2.430364
H  -0.020839 -1.526976 -3.503107
H  -1.631262 -1.780937 -2.835008
H  -0.770316 -0.269839 -2.533977
H  -3.360032 0.748712 1.48544
H  -4.360621 2.167627 -0.008059
H  -4.539762 -2.044484 -0.778928
H  -5.664725 -1.59682 -2.929382
H  -6.106832 0.72133 -3.650804
H  -2.879902 2.946581 -2.134326
H  -6.550997 5.146234 -1.805047
H  -1.619333 4.982006 -1.605619
H  -5.269814 7.195254 -1.30015
H  -2.795796 7.119508 -1.182576
elementType: Br O N C H
nucrepener: 5550.12391821 hartree
twoeener: 9953.42148479 hartree
cpcmener: -0.03606630 hartree
xcener: -389.799506471932 hartree
chargesum: 0.0000000
charge: -0.084809 -0.012576 -0.012920 -0.001856 -0.271937 -0.451428 -0.334576 -0.100285 0.100515 -0.086909 -0.149636 -0.153744 -0.265350 -0.260488 0.396576 0.033604 0.416772 0.030822 -0.218282 -0.222825 -0.257497 0.314924 -0.113049 -0.238274 0.313076 -0.213486 -0.262967 -0.142020 -0.117715 -0.193028 0.116422 0.123057 0.170754 0.094545 0.109249 0.098815 0.102494 0.102195 0.093974 0.142963 0.150184 0.148781 0.162787 0.151033 0.160198 0.147835 0.162000 0.161116 0.160966
qa: -0.0848 -0.0126 -0.0129 -0.0019 -0.2719 -0.4514 -0.3346 -0.1003 0.1005 -0.0869 -0.1496 -0.1537 -0.2653 -0.2605 0.3966 0.0336 0.4168 0.0308 -0.2183 -0.2228 -0.2575 0.3149 -0.1130 -0.2383 0.3131 -0.2135 -0.2630 -0.1420 -0.1177 -0.1930 0.1164 0.1231 0.1708 0.0945 0.1092 0.0988 0.1025 0.1022 0.0940 0.1430 0.1502 0.1488 0.1628 0.1510 0.1602 0.1478 0.1620 0.1611 0.1610
va: 1.1805 1.2217 1.2250 1.2295 2.1351 2.0549 2.0803 3.1101 3.8707 3.7425 3.8670 4.0515 3.8968 3.9012 4.1634 4.3535 3.7147 3.5698 4.0807 3.9518 3.9665 3.6954 3.8906 4.0106 3.6602 3.9114 4.0131 3.8840 3.8714 3.9083 1.0449 1.0217 0.9926 1.0039 1.0025 1.0054 1.0038 1.0013 1.0140 1.0172 1.0038 1.0114 0.9877 1.0047 0.9977 1.0080 0.9895 0.9879 0.9895
dispcorr: -0.030117775 hartree
energy: -11427.159399279333
dipole: -155.25436 155.67682 0.42246 36.35617 -36.83389 -0.47771 -58.55819 57.25930 -1.29889
magnitude: 1.44700 au
magnitude: 3.67797 debye
