program: Orca
programVersion: 5.0.2
elementType: Br Br Br Br O O O N C C C C C C C C C C C C C C C C C C C C C C H H H H H H H H H H H H H H H H H H H
charge: 0
multiplicity: 1
keywords: wb97x-d3
keywords: def2-TZVPP
keywords: def2/J RIJCOSX
keywords: DEFGRID2
keywords: scfconv7
keywords: smallprint printgap noloewdin
keywords: NOSOSCF
formula: C22H19Br4NO3
InChI: InChI=1/C22H19Br4NO3/c1-21(2)17(19(23)22(24,25)26)18(21)20(28)30-16(12-27)13-7-6-10-15(11-13)29-14-8-4-3-5-9-14/h3-11,16-19H,1-2H3
49 atoms
Br 3.94836 -2.641765 1.023058
Br 2.606073 -2.111085 -2.12294
Br 0.994471 0.32708 -0.992367
Br 4.112265 0.287741 -0.754373
O  -2.175451 -0.851477 0.798026
O  -1.626587 -2.847407 -0.034041
O  -3.706824 3.879137 0.964954
N  -2.821764 -0.753029 -2.523795
C  0.626872 -2.775278 2.185506
C  1.15497 -2.324182 0.864047
C  -0.104459 -1.690846 1.41497
C  2.391601 -1.493505 0.697815
C  1.267809 -2.314241 3.472872
C  0.07292 -4.175024 2.275186
C  -1.349863 -1.902083 0.66172
C  2.529659 -0.825697 -0.682264
C  -3.372614 -0.865345 0.034475
C  -4.194716 0.34026 0.413138
C  -3.045921 -0.817893 -1.397186
C  -3.601038 1.593837 0.487435
C  -5.551448 0.186883 0.656509
C  -4.371502 2.692548 0.836021
C  -6.311992 1.298679 0.990675
C  -5.731716 2.552661 1.092483
C  -4.351968 5.069836 0.727951
C  -5.11988 5.272423 -0.411337
C  -4.149204 6.092852 1.641695
C  -5.695708 6.516698 -0.623506
C  -4.720146 7.336482 1.409283
C  -5.498614 7.552225 0.280917
H  0.985529 -3.039307 0.065438
H  -0.004345 -0.700887 1.844926
H  2.438476 -0.701253 1.450181
H  1.64428 -1.292622 3.426432
H  0.534997 -2.350948 4.28018
H  2.094661 -2.96943 3.747935
H  -0.726807 -4.224658 3.015478
H  -0.313965 -4.547769 1.330168
H  0.862622 -4.855361 2.596852
H  -3.947887 -1.778429 0.214511
H  -2.545605 1.728887 0.284563
H  -6.01044 -0.791038 0.591123
H  -7.369256 1.186301 1.189031
H  -6.337475 3.403402 1.375506
H  -5.267451 4.475742 -1.129556
H  -3.544315 5.918922 2.522487
H  -6.296436 6.676969 -1.509043
H  -4.557627 8.13601 2.119981
H  -5.946704 8.520961 0.105213
elementType: Br O N C H
nucrepener: 5520.95228331 hartree
twoeener: 9925.75097176 hartree
cpcmener: -0.03886681 hartree
xcener: -389.800088043793 hartree
chargesum: -0.0000000
charge: -0.081440 -0.013355 -0.019438 -0.002134 -0.271857 -0.453511 -0.334872 -0.094873 0.106685 -0.114295 -0.130342 -0.143134 -0.259764 -0.263704 0.390296 0.045099 0.432990 0.011926 -0.241515 -0.226141 -0.191245 0.239491 -0.141472 -0.178487 0.278484 -0.191835 -0.243323 -0.145612 -0.127412 -0.182797 0.122165 0.120980 0.168078 0.093406 0.109459 0.098916 0.105219 0.094148 0.098129 0.134503 0.135083 0.149281 0.163535 0.159431 0.161290 0.148290 0.162387 0.161285 0.162001
qa: -0.0814 -0.0134 -0.0194 -0.0021 -0.2719 -0.4535 -0.3349 -0.0949 0.1067 -0.1143 -0.1303 -0.1431 -0.2598 -0.2637 0.3903 0.0451 0.4330 0.0119 -0.2415 -0.2261 -0.1912 0.2395 -0.1415 -0.1785 0.2785 -0.1918 -0.2433 -0.1456 -0.1274 -0.1828 0.1222 0.1210 0.1681 0.0934 0.1095 0.0989 0.1052 0.0941 0.0981 0.1345 0.1351 0.1493 0.1635 0.1594 0.1613 0.1483 0.1624 0.1613 0.1620
va: 1.1829 1.2214 1.2281 1.2307 2.1580 2.0468 2.0671 3.1069 3.8623 3.7489 3.9059 4.0505 3.9039 3.8970 4.1522 4.3392 3.7169 3.7260 4.0266 4.0741 3.9600 3.8140 3.9090 3.9005 3.6721 3.9173 4.0062 3.8819 3.8788 3.8942 1.0429 1.0215 0.9935 1.0035 1.0026 1.0054 0.9996 1.0176 1.0019 1.0190 1.0268 1.0017 0.9902 0.9944 0.9949 1.0070 0.9892 0.9882 0.9891
dispcorr: -0.028881572 hartree
energy: -11427.158942760621
dipole: -149.46985 147.84205 -1.62780 50.50457 -49.59534 0.90923 52.17951 -49.08780 3.09171
magnitude: 3.61041 au
magnitude: 9.17694 debye
