program: Orca
programVersion: 5.0.2
elementType: Br Br Br Br O O O N C C C C C C C C C C C C C C C C C C C C C C H H H H H H H H H H H H H H H H H H H
charge: 0
multiplicity: 1
keywords: wb97x-d3
keywords: def2-TZVPP
keywords: def2/J RIJCOSX
keywords: DEFGRID2
keywords: scfconv7
keywords: smallprint printgap noloewdin
keywords: NOSOSCF
formula: C22H19Br4NO3
InChI: InChI=1/C22H19Br4NO3/c1-21(2)17(19(23)22(24,25)26)18(21)20(28)30-16(12-27)13-7-6-10-15(11-13)29-14-8-4-3-5-9-14/h3-11,16-19H,1-2H3
49 atoms
Br 4.028255 -1.901971 -0.794203
Br 3.328889 -0.313225 2.20351
Br 0.764226 -2.094376 2.510995
Br 3.571581 -3.447805 2.231943
O  -2.274394 -0.589816 -0.150278
O  -0.750083 1.027557 0.07156
O  -4.15704 4.848573 -1.402143
N  -5.443106 -1.065867 0.601788
C  0.811033 -1.003661 -1.826503
C  1.399584 -0.936489 -0.451772
C  -0.080131 -1.171626 -0.606438
C  2.284168 -2.014259 0.103578
C  0.966957 -2.236275 -2.684066
C  0.778505 0.272061 -2.631968
C  -1.019569 -0.114898 -0.190239
C  2.491263 -1.956732 1.627371
C  -3.296286 0.35164 0.145778
C  -3.552786 1.309764 -0.995889
C  -4.490353 -0.455449 0.405785
C  -3.756784 2.650917 -0.714527
C  -3.608236 0.845353 -2.304735
C  -4.015456 3.539635 -1.7504
C  -3.854005 1.746271 -3.328797
C  -4.056407 3.093586 -3.065344
C  -4.955788 5.684099 -2.138124
C  -4.454565 6.942439 -2.436118
C  -6.243072 5.322674 -2.516058
C  -5.253079 7.849758 -3.118304
C  -7.024382 6.234742 -3.210172
C  -6.536052 7.499001 -3.513638
H  1.670501 0.068314 -0.143262
H  -0.444673 -2.182713 -0.462772
H  1.88684 -3.005891 -0.129145
H  0.963325 -3.165094 -2.113817
H  0.141275 -2.294281 -3.395454
H  1.892689 -2.195415 -3.259126
H  1.68489 0.343953 -3.235624
H  -0.07401 0.278361 -3.313807
H  0.726525 1.16887 -2.018239
H  -3.068361 0.906516 1.062289
H  -3.710775 3.012476 0.305918
H  -3.459859 -0.202718 -2.531892
H  -3.888049 1.398633 -4.352908
H  -4.236851 3.780051 -3.882547
H  -3.450876 7.209986 -2.130142
H  -6.638836 4.344824 -2.270463
H  -4.863088 8.833267 -3.346896
H  -8.026821 5.954566 -3.507269
H  -7.153561 8.206625 -4.051022
elementType: Br O N C H
nucrepener: 5404.77050059 hartree
twoeener: 9808.38928257 hartree
cpcmener: -0.03162689 hartree
xcener: -389.799063079135 hartree
chargesum: -0.0000000
charge: -0.080904 -0.011742 -0.011948 -0.001427 -0.273424 -0.423612 -0.324335 -0.086475 0.097649 -0.089373 -0.145835 -0.155561 -0.261782 -0.260309 0.372864 0.035230 0.408612 0.040257 -0.226653 -0.237069 -0.238931 0.269529 -0.135996 -0.175797 0.272552 -0.239356 -0.189450 -0.125485 -0.144227 -0.178314 0.117043 0.119145 0.167052 0.092316 0.108505 0.098638 0.101526 0.099253 0.096576 0.141085 0.133782 0.147807 0.160236 0.157728 0.146395 0.159223 0.157893 0.158904 0.158203
qa: -0.0809 -0.0117 -0.0119 -0.0014 -0.2734 -0.4236 -0.3243 -0.0865 0.0976 -0.0894 -0.1458 -0.1556 -0.2618 -0.2603 0.3729 0.0352 0.4086 0.0403 -0.2267 -0.2371 -0.2389 0.2695 -0.1360 -0.1758 0.2726 -0.2394 -0.1894 -0.1255 -0.1442 -0.1783 0.1170 0.1191 0.1671 0.0923 0.1085 0.0986 0.1015 0.0993 0.0966 0.1411 0.1338 0.1478 0.1602 0.1577 0.1464 0.1592 0.1579 0.1589 0.1582
va: 1.1831 1.2226 1.2265 1.2302 2.1247 2.0908 2.0802 3.1127 3.8722 3.7468 3.8639 4.0639 3.8985 3.8984 4.1944 4.3534 3.7136 3.6077 4.0776 4.0861 3.9640 3.7670 3.9146 3.9116 3.6929 4.0085 3.9181 3.8860 3.8906 3.9007 1.0456 1.0240 0.9945 1.0039 1.0028 1.0060 1.0037 1.0018 1.0168 1.0177 1.0189 1.0129 0.9907 0.9958 1.0075 0.9956 0.9892 0.9904 0.9903
dispcorr: -0.029121968 hartree
energy: -11427.174788085109
dipole: -145.91569 146.01910 0.10341 102.68232 -102.31836 0.36396 -96.97285 94.92357 -2.04928
magnitude: 2.08392 au
magnitude: 5.29690 debye
