program: Orca
programVersion: 5.0.2
elementType: Br Br Br Br O O O N C C C C C C C C C C C C C C C C C C C C C C H H H H H H H H H H H H H H H H H H H
charge: 0
multiplicity: 1
keywords: wb97x-d3
keywords: def2-TZVPP
keywords: def2/J RIJCOSX
keywords: DEFGRID2
keywords: scfconv7
keywords: smallprint printgap noloewdin
keywords: NOSOSCF
formula: C22H19Br4NO3
InChI: InChI=1/C22H19Br4NO3/c1-21(2)17(19(23)22(24,25)26)18(21)20(28)30-16(12-27)13-7-6-10-15(11-13)29-14-8-4-3-5-9-14/h3-11,16-19H,1-2H3
49 atoms
Br 4.017015 -1.828982 -0.818338
Br 3.303836 -0.315969 2.217624
Br 0.789849 -2.175573 2.509818
Br 3.630912 -3.443733 2.176409
O  -2.311088 -0.663904 -0.13782
O  -0.807691 0.964211 0.141349
O  -4.186864 4.777606 -1.367498
N  -5.495191 -1.169059 0.54251
C  0.769818 -1.010036 -1.808022
C  1.370411 -0.943063 -0.438062
C  -0.104341 -1.210195 -0.580359
C  2.287311 -2.005257 0.094102
C  0.946672 -2.230909 -2.67815
C  0.700543 0.271732 -2.600874
C  -1.060948 -0.175156 -0.148426
C  2.504517 -1.969669 1.616599
C  -3.348116 0.264947 0.14582
C  -3.580417 1.236772 -0.989572
C  -4.542129 -0.553673 0.36551
C  -3.800993 2.572878 -0.697605
C  -3.590738 0.789161 -2.305329
C  -4.028386 3.474543 -1.729835
C  -3.805085 1.702719 -3.325079
C  -4.021776 3.045747 -3.051142
C  -4.949752 5.627584 -2.124433
C  -4.435774 6.892459 -2.368628
C  -6.215873 5.274313 -2.574908
C  -5.199148 7.813988 -3.071604
C  -6.961376 6.200824 -3.289219
C  -6.459633 7.471444 -3.540046
H  1.620848 0.064236 -0.120497
H  -0.448442 -2.229587 -0.444728
H  1.919755 -3.003642 -0.157449
H  1.864571 -2.161834 -3.262962
H  0.973053 -3.164522 -2.116366
H  0.114541 -2.303662 -3.380575
H  0.617564 1.160541 -1.978881
H  1.606606 0.37794 -3.199916
H  -0.148981 0.257718 -3.286336
H  -3.148366 0.808393 1.075674
H  -3.790187 2.921332 0.328388
H  -3.429006 -0.25499 -2.541287
H  -3.802358 1.368545 -4.354204
H  -4.175983 3.741837 -3.865473
H  -3.449967 7.153658 -2.004678
H  -6.622198 4.291211 -2.371419
H  -4.800081 8.802893 -3.256969
H  -7.945964 5.926208 -3.64527
H  -7.049285 8.190074 -4.093826
elementType: Br O N C H
nucrepener: 5408.02415066 hartree
twoeener: 9811.63417628 hartree
cpcmener: -0.03159255 hartree
xcener: -389.800168048640 hartree
chargesum: -0.0000000
charge: -0.080682 -0.011372 -0.011359 -0.002038 -0.272988 -0.422482 -0.323966 -0.086133 0.099622 -0.088244 -0.148347 -0.158909 -0.262222 -0.261464 0.371796 0.035939 0.407979 0.046399 -0.227551 -0.240434 -0.246724 0.276234 -0.132354 -0.179746 0.276701 -0.241192 -0.193242 -0.124599 -0.143254 -0.179252 0.116483 0.119793 0.168074 0.098564 0.092420 0.108643 0.096985 0.102431 0.099127 0.141159 0.133469 0.147868 0.160303 0.157489 0.146634 0.159188 0.157990 0.159162 0.158098
qa: -0.0807 -0.0114 -0.0114 -0.0020 -0.2730 -0.4225 -0.3240 -0.0861 0.0996 -0.0882 -0.1483 -0.1589 -0.2622 -0.2615 0.3718 0.0359 0.4080 0.0464 -0.2276 -0.2404 -0.2467 0.2762 -0.1324 -0.1797 0.2767 -0.2412 -0.1932 -0.1246 -0.1433 -0.1793 0.1165 0.1198 0.1681 0.0986 0.0924 0.1086 0.0970 0.1024 0.0991 0.1412 0.1335 0.1479 0.1603 0.1575 0.1466 0.1592 0.1580 0.1592 0.1581
va: 1.1840 1.2228 1.2264 1.2301 2.1250 2.0914 2.0816 3.1129 3.8713 3.7461 3.8636 4.0658 3.8981 3.8969 4.1998 4.3513 3.7142 3.5994 4.0775 4.0875 3.9631 3.7616 3.9112 3.9146 3.6895 4.0100 3.9203 3.8856 3.8899 3.9023 1.0458 1.0234 0.9943 1.0061 1.0040 1.0027 1.0167 1.0039 1.0020 1.0175 1.0191 1.0129 0.9906 0.9959 1.0076 0.9957 0.9893 0.9903 0.9904
dispcorr: -0.029236290 hartree
energy: -11427.174796186424
dipole: -146.39917 146.53244 0.13326 101.77382 -101.38284 0.39098 -96.34477 94.29637 -2.04840
magnitude: 2.08964 au
magnitude: 5.31144 debye
