program: Orca
programVersion: 5.0.2
elementType: Br Br Br Br O O O N C C C C C C C C C C C C C C C C C C C C C C H H H H H H H H H H H H H H H H H H H
charge: 0
multiplicity: 1
keywords: wb97x-d3
keywords: def2-TZVPP
keywords: def2/J RIJCOSX
keywords: DEFGRID2
keywords: scfconv7
keywords: smallprint printgap noloewdin
keywords: NOSOSCF
formula: C22H19Br4NO3
InChI: InChI=1/C22H19Br4NO3/c1-21(2)17(19(23)22(24,25)26)18(21)20(28)30-16(12-27)13-7-6-10-15(11-13)29-14-8-4-3-5-9-14/h3-11,16-19H,1-2H3
49 atoms
Br 3.749602 -1.190425 -1.360659
Br 3.237169 0.607676 1.56981
Br 1.094199 -1.516664 2.432916
Br 4.024138 -2.430126 1.81884
O  -2.489874 -0.758576 0.260299
O  -1.246526 1.079903 -0.040036
O  -5.110712 2.968003 -2.993748
N  -4.826172 -1.285668 2.539858
C  0.310914 -0.929671 -1.924266
C  1.081266 -0.609645 -0.682066
C  -0.34754 -1.073839 -0.561188
C  2.20499 -1.46733 -0.180007
C  0.532085 -2.224421 -2.667914
C  -0.041833 0.218881 -2.836468
C  -1.365908 -0.116389 -0.094175
C  2.626372 -1.202587 1.27665
C  -3.607675 0.04051 0.648758
C  -4.500351 0.312513 -0.536488
C  -4.286881 -0.717417 1.700315
C  -4.390761 1.544395 -1.172043
C  -5.364407 -0.66097 -1.019703
C  -5.167069 1.803584 -2.294547
C  -6.13162 -0.387167 -2.142857
C  -6.041733 0.837878 -2.780627
C  -4.478097 4.063318 -2.458343
C  -4.986707 4.693655 -1.330953
C  -3.354236 4.550734 -3.105378
C  -4.35001 5.826414 -0.846618
C  -2.734129 5.693816 -2.618255
C  -3.225102 6.330414 -1.487371
H  1.225064 0.454417 -0.523455
H  -0.519204 -2.101196 -0.260537
H  1.958465 -2.529587 -0.260438
H  1.354542 -2.130832 -3.378228
H  0.744277 -3.069801 -2.013606
H  -0.364503 -2.477693 -3.236188
H  -0.133026 1.170784 -2.317681
H  0.738077 0.33427 -3.59127
H  -0.980653 0.026116 -3.35871
H  -3.277591 0.981793 1.097407
H  -3.702481 2.284819 -0.785849
H  -5.451147 -1.622635 -0.529143
H  -6.814644 -1.135182 -2.523258
H  -6.646092 1.050486 -3.653608
H  -5.869261 4.305942 -0.836937
H  -2.974199 4.04592 -3.984851
H  -4.740091 6.319844 0.034144
H  -1.860337 6.08253 -3.125056
H  -2.735877 7.217743 -1.107578
elementType: Br O N C H
nucrepener: 5530.37890797 hartree
twoeener: 9934.06152983 hartree
cpcmener: -0.02894275 hartree
xcener: -389.799338949605 hartree
chargesum: 0.0000000
charge: -0.081413 -0.009762 -0.013146 -0.000831 -0.268823 -0.436906 -0.322276 -0.087201 0.098215 -0.089027 -0.168075 -0.159197 -0.262094 -0.265425 0.414807 0.036619 0.395676 -0.024476 -0.221352 -0.172736 -0.219160 0.300739 -0.117680 -0.238193 0.253774 -0.187339 -0.211140 -0.144231 -0.137421 -0.164098 0.116117 0.119539 0.169275 0.099071 0.092459 0.108556 0.095242 0.100369 0.104128 0.133722 0.136107 0.141375 0.158809 0.146613 0.156084 0.147937 0.159535 0.158175 0.159060
qa: -0.0814 -0.0098 -0.0131 -0.0008 -0.2688 -0.4369 -0.3223 -0.0872 0.0982 -0.0890 -0.1681 -0.1592 -0.2621 -0.2654 0.4148 0.0366 0.3957 -0.0245 -0.2214 -0.1727 -0.2192 0.3007 -0.1177 -0.2382 0.2538 -0.1873 -0.2111 -0.1442 -0.1374 -0.1641 0.1161 0.1195 0.1693 0.0991 0.0925 0.1086 0.0952 0.1004 0.1041 0.1337 0.1361 0.1414 0.1588 0.1466 0.1561 0.1479 0.1595 0.1582 0.1591
va: 1.1839 1.2244 1.2260 1.2312 2.1293 2.0758 2.0905 3.1114 3.8609 3.7346 3.8945 4.0625 3.8989 3.9031 4.1579 4.3510 3.7335 3.7287 4.0669 3.8764 4.0037 3.7372 3.9173 4.0159 3.7018 3.9437 4.0019 3.8877 3.8892 3.8936 1.0457 1.0238 0.9935 1.0062 1.0045 1.0025 1.0174 1.0031 0.9995 1.0222 1.0265 1.0088 0.9896 1.0071 0.9972 1.0051 0.9899 0.9896 0.9900
dispcorr: -0.029308259 hartree
energy: -11427.175033043741
dipole: -149.38367 149.32694 -0.05674 60.42802 -60.21351 0.21451 -74.04427 72.17410 -1.87017
magnitude: 1.88328 au
magnitude: 4.78692 debye
