program: Orca
programVersion: 5.0.2
elementType: Br Br Br Br O O O N C C C C C C C C C C C C C C C C C C C C C C H H H H H H H H H H H H H H H H H H H
charge: 0
multiplicity: 1
keywords: wb97x-d3
keywords: def2-TZVPP
keywords: def2/J RIJCOSX
keywords: DEFGRID2
keywords: scfconv7
keywords: smallprint printgap noloewdin
keywords: NOSOSCF
formula: C22H19Br4NO3
InChI: InChI=1/C22H19Br4NO3/c1-21(2)17(19(23)22(24,25)26)18(21)20(28)30-16(12-27)13-7-6-10-15(11-13)29-14-8-4-3-5-9-14/h3-11,16-19H,1-2H3
49 atoms
Br 4.02898 -1.539907 -0.848338
Br 3.209427 -0.064417 2.157421
Br 0.79856 -2.045204 2.455694
Br 3.701804 -3.17597 2.154174
O  -2.368642 -0.965841 -0.171231
O  -1.073796 0.839508 0.070369
O  -5.181798 4.1265 -1.210377
N  -5.42801 -1.881535 0.661311
C  0.743375 -0.924488 -1.868514
C  1.315384 -0.832692 -0.488802
C  -0.125209 -1.237583 -0.661312
C  2.304356 -1.826037 0.046568
C  1.051543 -2.100256 -2.763587
C  0.559709 0.363999 -2.630606
C  -1.190166 -0.323177 -0.214658
C  2.507012 -1.766485 1.56995
C  -3.501461 -0.184551 0.176378
C  -3.928056 0.751093 -0.931702
C  -4.565981 -1.152598 0.450915
C  -4.318198 2.040044 -0.607928
C  -3.944842 0.317115 -2.251889
C  -4.750832 2.898716 -1.609888
C  -4.365842 1.190711 -3.242205
C  -4.777714 2.4791 -2.933682
C  -5.014554 5.221579 -2.0164
C  -6.086933 6.093303 -2.131725
C  -3.804453 5.494893 -2.641859
C  -5.944299 7.254131 -2.87885
C  -3.680567 6.652958 -3.395512
C  -4.745485 7.535798 -3.518428
H  1.467485 0.185865 -0.145299
H  -0.362308 -2.289883 -0.54921
H  2.002707 -2.847612 -0.200485
H  1.963193 -1.92547 -3.335795
H  1.168226 -3.038511 -2.22116
H  0.237967 -2.242018 -3.477137
H  1.452315 0.564338 -3.225653
H  -0.286004 0.291061 -3.317048
H  0.398939 1.226694 -1.98752
H  -3.324708 0.376969 1.100077
H  -4.292519 2.382582 0.419775
H  -3.640189 -0.688525 -2.512303
H  -4.387457 0.862645 -4.273068
H  -5.118738 3.138363 -3.721622
H  -7.022074 5.867604 -1.634468
H  -2.963281 4.820168 -2.540702
H  -6.780543 7.935888 -2.965498
H  -2.73866 6.867625 -3.883764
H  -4.639346 8.438572 -4.105393
elementType: Br O N C H
nucrepener: 5434.39740445 hartree
twoeener: 9837.78070677 hartree
cpcmener: -0.03162229 hartree
xcener: -389.802245953870 hartree
chargesum: -0.0000000
charge: -0.080371 -0.012342 -0.011894 -0.001253 -0.274410 -0.425031 -0.325260 -0.085881 0.096119 -0.084198 -0.144430 -0.160068 -0.261425 -0.261046 0.375075 0.036796 0.402654 0.033302 -0.224444 -0.228968 -0.232187 0.261427 -0.136935 -0.171383 0.269484 -0.240139 -0.184896 -0.125276 -0.146410 -0.178169 0.117025 0.118559 0.166870 0.098341 0.091347 0.109035 0.101515 0.099849 0.096795 0.142718 0.134017 0.147100 0.160114 0.157587 0.146716 0.158827 0.157619 0.159510 0.158016
qa: -0.0804 -0.0123 -0.0119 -0.0013 -0.2744 -0.4250 -0.3253 -0.0859 0.0961 -0.0842 -0.1444 -0.1601 -0.2614 -0.2610 0.3751 0.0368 0.4027 0.0333 -0.2244 -0.2290 -0.2322 0.2614 -0.1369 -0.1714 0.2695 -0.2401 -0.1849 -0.1253 -0.1464 -0.1782 0.1170 0.1186 0.1669 0.0983 0.0913 0.1090 0.1015 0.0998 0.0968 0.1427 0.1340 0.1471 0.1601 0.1576 0.1467 0.1588 0.1576 0.1595 0.1580
va: 1.1839 1.2226 1.2265 1.2307 2.1221 2.0888 2.0785 3.1133 3.8716 3.7376 3.8601 4.0695 3.8988 3.8985 4.1825 4.3537 3.7179 3.6121 4.0772 4.0872 3.9608 3.7752 3.9140 3.9094 3.6976 4.0074 3.9142 3.8878 3.8911 3.9013 1.0457 1.0249 0.9944 1.0064 1.0039 1.0024 1.0035 1.0014 1.0170 1.0174 1.0186 1.0130 0.9906 0.9953 1.0075 0.9962 0.9894 0.9903 0.9904
dispcorr: -0.029113711 hartree
energy: -11427.174771938773
dipole: -143.41972 144.00229 0.58257 90.86873 -90.26891 0.59981 -94.81918 92.70789 -2.11129
magnitude: 2.27084 au
magnitude: 5.77202 debye
