program: Orca
programVersion: 5.0.2
elementType: Br Br Br Br O O O N C C C C C C C C C C C C C C C C C C C C C C H H H H H H H H H H H H H H H H H H H
charge: 0
multiplicity: 1
keywords: wb97x-d3
keywords: def2-TZVPP
keywords: def2/J RIJCOSX
keywords: DEFGRID2
keywords: scfconv7
keywords: smallprint printgap noloewdin
keywords: NOSOSCF
formula: C22H19Br4NO3
InChI: InChI=1/C22H19Br4NO3/c1-21(2)17(19(23)22(24,25)26)18(21)20(28)30-16(12-27)13-7-6-10-15(11-13)29-14-8-4-3-5-9-14/h3-11,16-19H,1-2H3
49 atoms
Br 3.92296 -1.530826 -1.035015
Br 3.192989 0.098743 1.929444
Br 0.890395 -1.961366 2.464746
Br 3.818394 -2.98068 2.065196
O  -2.438821 -1.051066 0.000204
O  -1.150647 0.772845 0.072467
O  -5.164078 4.079729 -0.95422
N  -5.406027 -1.983853 1.073718
C  0.548256 -1.08938 -1.89927
C  1.210707 -0.883486 -0.573294
C  -0.226893 -1.329517 -0.615427
C  2.25758 -1.81233 -0.034728
C  0.827734 -2.32237 -2.723349
C  0.271933 0.134196 -2.736234
C  -1.273727 -0.402592 -0.150643
C  2.53382 -1.65836 1.469882
C  -3.550774 -0.267711 0.411184
C  -4.054153 0.651603 -0.677506
C  -4.581035 -1.241666 0.77829
C  -4.350965 1.967443 -0.36097
C  -4.21142 0.184591 -1.97695
C  -4.827893 2.819862 -1.34735
C  -4.674183 1.052243 -2.954131
C  -4.990243 2.368652 -2.650972
C  -4.947061 5.148522 -1.783163
C  -3.752141 5.314634 -2.472355
C  -5.948669 6.10521 -1.85815
C  -3.570469 6.452771 -3.244602
C  -5.748342 7.243519 -2.626102
C  -4.563308 7.420426 -3.326031
H  1.357862 0.160645 -0.315597
H  -0.431517 -2.375037 -0.413371
H  1.977626 -2.855667 -0.206378
H  1.694553 -2.170753 -3.367405
H  1.006622 -3.212643 -2.120482
H  -0.027316 -2.538053 -3.366385
H  0.137915 1.037953 -2.14509
H  1.10777 0.309891 -3.415431
H  -0.624173 -0.008671 -3.343119
H  -3.312266 0.309038 1.311593
H  -4.214945 2.335926 0.648859
H  -3.980045 -0.84209 -2.231439
H  -4.802545 0.698608 -3.968677
H  -5.364002 3.026096 -3.425703
H  -2.965215 4.573371 -2.405655
H  -6.873411 5.962056 -1.313148
H  -2.639539 6.584435 -3.781008
H  -6.529082 7.991359 -2.680394
H  -4.41204 8.30695 -3.927719
elementType: Br O N C H
nucrepener: 5450.92466751 hartree
twoeener: 9854.34694542 hartree
cpcmener: -0.03159949 hartree
xcener: -389.803162608202 hartree
chargesum: 0.0000000
charge: -0.079409 -0.011389 -0.011692 -0.001629 -0.271950 -0.424081 -0.326873 -0.085831 0.099034 -0.084216 -0.144240 -0.160651 -0.263103 -0.261516 0.373635 0.034834 0.404073 0.029460 -0.225719 -0.221051 -0.231497 0.249624 -0.136645 -0.165166 0.265014 -0.179257 -0.238049 -0.148538 -0.126765 -0.178253 0.116195 0.118464 0.166525 0.099596 0.091114 0.108767 0.096209 0.101834 0.099838 0.142074 0.134695 0.147510 0.160770 0.158550 0.158901 0.146247 0.159125 0.157452 0.157982
qa: -0.0794 -0.0114 -0.0117 -0.0016 -0.2720 -0.4241 -0.3269 -0.0858 0.0990 -0.0842 -0.1442 -0.1607 -0.2631 -0.2615 0.3736 0.0348 0.4041 0.0295 -0.2257 -0.2211 -0.2315 0.2496 -0.1366 -0.1652 0.2650 -0.1793 -0.2380 -0.1485 -0.1268 -0.1783 0.1162 0.1185 0.1665 0.0996 0.0911 0.1088 0.0962 0.1018 0.0998 0.1421 0.1347 0.1475 0.1608 0.1585 0.1589 0.1462 0.1591 0.1575 0.1580
va: 1.1847 1.2235 1.2269 1.2308 2.1264 2.0910 2.0750 3.1131 3.8721 3.7323 3.8581 4.0668 3.8982 3.8994 4.1860 4.3548 3.7216 3.6041 4.0782 4.0783 3.9619 3.7824 3.9129 3.9113 3.7035 3.9065 4.0043 3.8948 3.8891 3.9008 1.0463 1.0242 0.9945 1.0057 1.0042 1.0024 1.0162 1.0033 1.0012 1.0164 1.0181 1.0123 0.9903 0.9948 0.9965 1.0076 0.9905 0.9894 0.9903
dispcorr: -0.029191577 hartree
energy: -11427.174765151171
dipole: -146.50685 146.97095 0.46410 84.31140 -83.82608 0.48532 -87.84513 85.71339 -2.13175
magnitude: 2.23501 au
magnitude: 5.68094 debye
