program: Orca
programVersion: 5.0.2
elementType: Br Br Br Br O O O N C C C C C C C C C C C C C C C C C C C C C C H H H H H H H H H H H H H H H H H H H
charge: 0
multiplicity: 1
keywords: wb97x-d3
keywords: def2-TZVPP
keywords: def2/J RIJCOSX
keywords: DEFGRID2
keywords: scfconv7
keywords: smallprint printgap noloewdin
keywords: NOSOSCF
formula: C22H19Br4NO3
InChI: InChI=1/C22H19Br4NO3/c1-21(2)17(19(23)22(24,25)26)18(21)20(28)30-16(12-27)13-7-6-10-15(11-13)29-14-8-4-3-5-9-14/h3-11,16-19H,1-2H3
49 atoms
Br 3.608079 -1.131625 2.103015
Br 2.113202 -3.772522 0.474227
Br 1.370337 -1.85825 -1.902563
Br 4.364876 -2.211172 -1.073159
O  -1.830883 0.642341 -0.873731
O  -1.893038 -0.998023 0.643974
O  -4.785517 4.403795 1.260127
N  -3.606794 1.458612 -3.527996
C  0.608726 0.620168 1.733154
C  1.022174 -0.659241 1.07745
C  0.107251 0.283894 0.338273
C  2.412248 -0.894488 0.563888
C  1.551784 1.797273 1.807402
C  -0.308733 0.524552 2.926928
C  -1.286907 -0.120953 0.086456
C  2.558322 -2.098206 -0.381105
C  -3.209647 0.428358 -1.159774
C  -4.10453 1.08832 -0.138551
C  -3.416785 1.010959 -2.487739
C  -4.013427 2.461826 0.057916
C  -4.988313 0.322421 0.606676
C  -4.839018 3.068442 0.992867
C  -5.796074 0.941745 1.550404
C  -5.731149 2.311293 1.743286
C  -4.563233 5.308124 0.255479
C  -5.165429 5.193924 -0.991956
C  -3.753699 6.394249 0.555336
C  -4.937905 6.176813 -1.944409
C  -3.546047 7.375866 -0.403321
C  -4.130631 7.269622 -1.657606
H  0.53694 -1.53918 1.48849
H  0.548268 0.889251 -0.445662
H  2.784817 -0.016213 0.0303
H  2.187933 1.731908 2.690567
H  2.195233 1.892342 0.932675
H  0.977825 2.722278 1.883501
H  -0.949154 1.405866 2.993695
H  -0.946504 -0.356578 2.913265
H  0.288174 0.47954 3.839413
H  -3.438584 -0.639459 -1.230649
H  -3.308924 3.050894 -0.518368
H  -5.048087 -0.747206 0.452457
H  -6.488452 0.353087 2.13748
H  -6.36774 2.79689 2.47227
H  -5.808368 4.354409 -1.225553
H  -3.296614 6.472352 1.533901
H  -5.40395 6.086546 -2.917185
H  -2.916851 8.224093 -0.166161
H  -3.961146 8.033187 -2.405277
elementType: Br O N C H
nucrepener: 5492.68835431 hartree
twoeener: 9896.31605769 hartree
cpcmener: -0.03002821 hartree
xcener: -389.800633370258 hartree
chargesum: -0.0000000
charge: -0.080997 -0.010909 -0.011959 -0.002197 -0.276695 -0.431520 -0.326829 -0.087031 0.092293 -0.083481 -0.151410 -0.161883 -0.261500 -0.259986 0.390158 0.038264 0.426735 0.020288 -0.231879 -0.208687 -0.193958 0.247199 -0.113740 -0.232207 0.288707 -0.194199 -0.253888 -0.140101 -0.117671 -0.186726 0.117911 0.118643 0.166696 0.098480 0.092245 0.108970 0.103523 0.094728 0.099575 0.139910 0.145726 0.145514 0.158746 0.149330 0.155239 0.145939 0.159455 0.157472 0.157710
qa: -0.0810 -0.0109 -0.0120 -0.0022 -0.2767 -0.4315 -0.3268 -0.0870 0.0923 -0.0835 -0.1514 -0.1619 -0.2615 -0.2600 0.3902 0.0383 0.4267 0.0203 -0.2319 -0.2087 -0.1940 0.2472 -0.1137 -0.2322 0.2887 -0.1942 -0.2539 -0.1401 -0.1177 -0.1867 0.1179 0.1186 0.1667 0.0985 0.0922 0.1090 0.1035 0.0947 0.0996 0.1399 0.1457 0.1455 0.1587 0.1493 0.1552 0.1459 0.1595 0.1575 0.1577
va: 1.1838 1.2241 1.2277 1.2289 2.1305 2.0845 2.0831 3.1105 3.8706 3.7325 3.8825 4.0731 3.8994 3.9007 4.1687 4.3500 3.7261 3.5873 4.0781 3.9564 3.9587 3.7668 3.9040 4.0119 3.6888 3.9069 4.0114 3.8902 3.8818 3.9084 1.0445 1.0246 0.9941 1.0061 1.0038 1.0029 0.9997 1.0182 1.0027 1.0162 1.0143 1.0068 0.9894 1.0045 0.9977 1.0083 0.9901 0.9892 0.9905
dispcorr: -0.029354672 hartree
energy: -11427.175427661134
dipole: -141.89306 141.80781 -0.08526 125.78633 -124.87293 0.91340 17.59216 -16.43135 1.16081
magnitude: 1.47955 au
magnitude: 3.76071 debye
