program: Orca
programVersion: 5.0.2
elementType: Br Br Br Br O O O N C C C C C C C C C C C C C C C C C C C C C C H H H H H H H H H H H H H H H H H H H
charge: 0
multiplicity: 1
keywords: wb97x-d3
keywords: def2-TZVPP
keywords: def2/J RIJCOSX
keywords: DEFGRID2
keywords: scfconv7
keywords: smallprint printgap noloewdin
keywords: NOSOSCF
formula: C22H19Br4NO3
InChI: InChI=1/C22H19Br4NO3/c1-21(2)17(19(23)22(24,25)26)18(21)20(28)30-16(12-27)13-7-6-10-15(11-13)29-14-8-4-3-5-9-14/h3-11,16-19H,1-2H3
49 atoms
Br 3.646583 -0.689033 1.951603
Br 1.967377 -3.58812 1.054361
Br 1.258701 -2.282643 -1.708048
Br 4.253901 -2.572229 -0.8476
O  -1.940719 0.448742 -1.0995
O  -1.872695 -0.829336 0.731437
O  -4.69094 4.37676 0.928769
N  -3.989139 0.888577 -3.648032
C  0.669463 1.02448 1.236088
C  1.039553 -0.391409 0.923202
C  0.090106 0.338772 0.009323
C  2.400845 -0.793333 0.437184
C  1.617355 2.163135 0.9461
C  -0.184021 1.267551 2.455646
C  -1.317009 -0.096043 -0.043687
C  2.470352 -2.197807 -0.188895
C  -3.330128 0.169766 -1.224803
C  -4.162888 0.941417 -0.228685
C  -3.678919 0.567476 -2.590212
C  -4.015106 2.321478 -0.144091
C  -5.057569 0.269718 0.589317
C  -4.795876 3.030029 0.757608
C  -5.821287 0.991349 1.496087
C  -5.699635 2.367351 1.581008
C  -4.37909 5.20403 -0.117161
C  -4.937838 5.049402 -1.380296
C  -3.52444 6.262687 0.155141
C  -4.619869 5.962072 -2.375712
C  -3.226735 7.175103 -0.846831
C  -3.766654 7.026451 -2.116766
H  0.566704 -1.116573 1.577816
H  0.483733 0.712427 -0.929309
H  2.77475 -0.089561 -0.311532
H  2.297234 2.32655 1.783089
H  2.216333 2.011097 0.048273
H  1.050231 3.084075 0.799061
H  0.457847 1.45612 3.317817
H  -0.815883 2.146684 2.315755
H  -0.826882 0.426869 2.708129
H  -3.527227 -0.903316 -1.133746
H  -3.302033 2.834664 -0.779076
H  -5.157737 -0.805778 0.521583
H  -6.521047 0.47743 2.141669
H  -6.299108 2.931674 2.284268
H  -5.616486 4.232904 -1.593399
H  -3.102613 6.373933 1.146316
H  -5.052493 5.84032 -3.360428
H  -2.562729 8.0022 -0.63085
H  -3.52766 7.735983 -2.897919
elementType: Br O N C H
nucrepener: 5513.60776154 hartree
twoeener: 9917.19481267 hartree
cpcmener: -0.03040539 hartree
xcener: -389.801201588108 hartree
chargesum: -0.0000000
charge: -0.080339 -0.011598 -0.011874 -0.001642 -0.278306 -0.426637 -0.325180 -0.086997 0.094719 -0.094193 -0.146805 -0.151111 -0.262557 -0.261278 0.381525 0.033966 0.427424 0.029085 -0.230906 -0.235764 -0.202040 0.271313 -0.109259 -0.238459 0.300345 -0.205592 -0.259085 -0.136647 -0.115220 -0.187886 0.118049 0.119441 0.166800 0.099693 0.091375 0.108505 0.100779 0.102675 0.095354 0.142323 0.147151 0.144777 0.159089 0.148334 0.155466 0.146081 0.159753 0.157534 0.157819
qa: -0.0803 -0.0116 -0.0119 -0.0016 -0.2783 -0.4266 -0.3252 -0.0870 0.0947 -0.0942 -0.1468 -0.1511 -0.2626 -0.2613 0.3815 0.0340 0.4274 0.0291 -0.2309 -0.2358 -0.2020 0.2713 -0.1093 -0.2385 0.3003 -0.2056 -0.2591 -0.1366 -0.1152 -0.1879 0.1180 0.1194 0.1668 0.0997 0.0914 0.1085 0.1008 0.1027 0.0954 0.1423 0.1472 0.1448 0.1591 0.1483 0.1555 0.1461 0.1598 0.1575 0.1578
va: 1.1833 1.2237 1.2263 1.2302 2.1288 2.0888 2.0868 3.1101 3.8803 3.7412 3.8702 4.0569 3.8994 3.9007 4.1832 4.3526 3.7148 3.5843 4.0805 3.9476 3.9724 3.7480 3.9011 4.0098 3.6781 3.9171 4.0146 3.8856 3.8789 3.9110 1.0459 1.0230 0.9941 1.0054 1.0045 1.0029 1.0030 1.0000 1.0174 1.0158 1.0160 1.0052 0.9892 1.0054 0.9981 1.0085 0.9899 0.9892 0.9906
dispcorr: -0.029623573 hartree
energy: -11427.175561404352
dipole: -137.40875 137.54510 0.13636 128.98156 -127.89933 1.08223 2.17458 -1.35666 0.81792
magnitude: 1.36338 au
magnitude: 3.46544 debye
