program: Orca
programVersion: 5.0.2
elementType: Br Br Br Br O O O N C C C C C C C C C C C C C C C C C C C C C C H H H H H H H H H H H H H H H H H H H
charge: 0
multiplicity: 1
keywords: wb97x-d3
keywords: def2-TZVPP
keywords: def2/J RIJCOSX
keywords: DEFGRID2
keywords: scfconv7
keywords: smallprint printgap noloewdin
keywords: NOSOSCF
formula: C22H19Br4NO3
InChI: InChI=1/C22H19Br4NO3/c1-21(2)17(19(23)22(24,25)26)18(21)20(28)30-16(12-27)13-7-6-10-15(11-13)29-14-8-4-3-5-9-14/h3-11,16-19H,1-2H3
49 atoms
Br 3.411758 -2.173282 -1.369469
Br 3.355218 0.887404 0.232258
Br 1.563401 -0.363364 2.488738
Br 4.374022 -1.59295 1.873039
O  -2.530136 -0.960342 0.88819
O  -1.410041 0.623616 -0.221276
O  -5.606823 2.878913 -2.388413
N  -5.273455 -1.166637 2.72383
C  -0.064208 -2.084246 -1.315854
C  0.883185 -1.214394 -0.54875
C  -0.451697 -1.555907 0.055896
C  2.146266 -1.738701 0.069116
C  0.136861 -3.577333 -1.403796
C  -0.677956 -1.496983 -2.562254
C  -1.4692 -0.498767 0.20679
C  2.818291 -0.773966 1.061258
C  -3.635939 -0.074369 1.00606
C  -4.341114 0.138221 -0.314005
C  -4.536665 -0.702749 1.974822
C  -4.641525 1.432413 -0.709729
C  -4.664361 -0.947502 -1.11844
C  -5.254757 1.643832 -1.938148
C  -5.285704 -0.720702 -2.336943
C  -5.575845 0.56825 -2.755956
C  -4.915316 3.999038 -2.008063
C  -3.526256 4.043288 -1.988017
C  -5.665468 5.125419 -1.702314
C  -2.893644 5.229025 -1.643147
C  -5.018398 6.308097 -1.373585
C  -3.63235 6.363854 -1.335184
H  0.962171 -0.206603 -0.943964
H  -0.471413 -2.314891 0.83063
H  1.962918 -2.67627 0.600962
H  0.783009 -3.834314 -2.243788
H  0.567622 -4.010199 -0.500877
H  -0.824365 -4.067687 -1.567463
H  -1.663849 -1.926571 -2.749698
H  -0.784143 -0.414536 -2.520505
H  -0.047622 -1.728149 -3.422719
H  -3.324164 0.887016 1.427834
H  -4.387356 2.262377 -0.062299
H  -4.435164 -1.959036 -0.807275
H  -5.540091 -1.556257 -2.975551
H  -6.051368 0.74267 -3.712985
H  -2.936777 3.16873 -2.234716
H  -6.74694 5.076539 -1.727916
H  -1.812001 5.262906 -1.621393
H  -5.60543 7.186704 -1.138816
H  -3.130454 7.284991 -1.069702
elementType: Br O N C H
nucrepener: 5534.31354446 hartree
twoeener: 9937.59372296 hartree
cpcmener: -0.03106256 hartree
xcener: -389.800640346307 hartree
chargesum: 0.0000000
charge: -0.083047 -0.012351 -0.012840 -0.000747 -0.270344 -0.424318 -0.323775 -0.086473 0.100863 -0.086299 -0.149851 -0.156056 -0.264075 -0.262017 0.378734 0.036957 0.402511 0.032553 -0.224009 -0.206650 -0.260743 0.302710 -0.108219 -0.233546 0.297455 -0.207468 -0.251750 -0.137582 -0.117056 -0.186451 0.114613 0.118973 0.165989 0.099218 0.091900 0.109090 0.099445 0.096198 0.103804 0.139724 0.143448 0.146692 0.158864 0.148341 0.157176 0.145391 0.159245 0.157873 0.157901
qa: -0.0830 -0.0124 -0.0128 -0.0007 -0.2703 -0.4243 -0.3238 -0.0865 0.1009 -0.0863 -0.1499 -0.1561 -0.2641 -0.2620 0.3787 0.0370 0.4025 0.0326 -0.2240 -0.2066 -0.2607 0.3027 -0.1082 -0.2335 0.2975 -0.2075 -0.2517 -0.1376 -0.1171 -0.1865 0.1146 0.1190 0.1660 0.0992 0.0919 0.1091 0.0994 0.0962 0.1038 0.1397 0.1434 0.1467 0.1589 0.1483 0.1572 0.1454 0.1592 0.1579 0.1579
va: 1.1812 1.2231 1.2257 1.2311 2.1311 2.0858 2.0919 3.1121 3.8695 3.7441 3.8587 4.0638 3.8965 3.8991 4.1912 4.3585 3.7300 3.5855 4.0747 3.9546 3.9653 3.7239 3.8959 4.0074 3.6796 3.9216 4.0167 3.8862 3.8779 3.9110 1.0470 1.0242 0.9944 1.0053 1.0034 1.0032 1.0024 1.0145 1.0042 1.0181 1.0064 1.0121 0.9889 1.0056 0.9992 1.0084 0.9901 0.9891 0.9905
dispcorr: -0.030021433 hartree
energy: -11427.175258310332
dipole: -158.32541 158.70069 0.37529 37.05169 -37.41682 -0.36513 -54.95285 53.76577 -1.18708
magnitude: 1.29743 au
magnitude: 3.29779 debye
