program: Orca
programVersion: 5.0.2
elementType: Br Br Br Br O O O N C C C C C C C C C C C C C C C C C C C C C C H H H H H H H H H H H H H H H H H H H
charge: 0
multiplicity: 1
keywords: wb97x-d3
keywords: def2-TZVPP
keywords: def2/J RIJCOSX
keywords: DEFGRID2
keywords: scfconv7
keywords: smallprint printgap noloewdin
keywords: NOSOSCF
formula: C22H19Br4NO3
InChI: InChI=1/C22H19Br4NO3/c1-21(2)17(19(23)22(24,25)26)18(21)20(28)30-16(12-27)13-7-6-10-15(11-13)29-14-8-4-3-5-9-14/h3-11,16-19H,1-2H3
49 atoms
Br 3.4223 -2.121743 -1.379361
Br 3.334889 0.909749 0.274296
Br 1.540779 -0.393886 2.499472
Br 4.364001 -1.590297 1.879233
O  -2.534386 -0.993935 0.8742
O  -1.429442 0.618668 -0.209567
O  -5.586816 2.870603 -2.373449
N  -5.27154 -1.268217 2.705941
C  -0.053766 -2.054105 -1.347217
C  0.88409 -1.193995 -0.558136
C  -0.451372 -1.556457 0.033053
C  2.146461 -1.720728 0.058694
C  0.155751 -3.543992 -1.463888
C  -0.665635 -1.444675 -2.583882
C  -1.478124 -0.510856 0.200689
C  2.806637 -0.769645 1.071211
C  -3.651389 -0.123495 1.00601
C  -4.356231 0.105065 -0.31128
C  -4.545311 -0.781894 1.960996
C  -4.643601 1.404291 -0.699564
C  -4.688966 -0.972749 -1.122475
C  -5.250814 1.628956 -1.928611
C  -5.307208 -0.733115 -2.339898
C  -5.582607 0.561336 -2.752356
C  -4.874695 3.97937 -1.998967
C  -3.485435 3.994167 -1.955963
C  -5.604886 5.126274 -1.722048
C  -2.833157 5.171037 -1.617135
C  -4.937827 6.29918 -1.398923
C  -3.551716 6.325761 -1.337576
H  0.958311 -0.178086 -0.932801
H  -0.468823 -2.330918 0.792437
H  1.96739 -2.669466 0.571987
H  0.804801 -3.781101 -2.307433
H  0.586839 -3.992079 -0.568493
H  -0.802626 -4.036117 -1.63879
H  -0.035583 -1.663614 -3.447717
H  -1.652823 -1.868031 -2.778548
H  -0.768181 -0.362734 -2.524491
H  -3.352049 0.83336 1.446793
H  -4.382919 2.227811 -0.046601
H  -4.469685 -1.988111 -0.81639
H  -5.570367 -1.56255 -2.982851
H  -6.054915 0.745902 -3.709056
H  -2.910011 3.103804 -2.178179
H  -6.686566 5.100478 -1.765621
H  -1.751593 5.181509 -1.577001
H  -5.509537 7.193545 -1.187126
H  -3.034392 7.239633 -1.076677
elementType: Br O N C H
nucrepener: 5538.93101384 hartree
twoeener: 9942.19568848 hartree
cpcmener: -0.03095034 hartree
xcener: -389.801204101317 hartree
chargesum: -0.0000000
charge: -0.082968 -0.012175 -0.013288 -0.000627 -0.269513 -0.424770 -0.323636 -0.086264 0.100690 -0.086921 -0.148942 -0.156358 -0.264345 -0.260861 0.378563 0.036879 0.402364 0.034506 -0.224676 -0.211736 -0.260404 0.306448 -0.107863 -0.234583 0.302951 -0.210328 -0.255105 -0.137323 -0.115623 -0.187873 0.114872 0.118921 0.166379 0.099215 0.091811 0.109191 0.103392 0.099752 0.095659 0.139738 0.144530 0.146427 0.158923 0.148194 0.156965 0.145161 0.159120 0.157701 0.157830
qa: -0.0830 -0.0122 -0.0133 -0.0006 -0.2695 -0.4248 -0.3236 -0.0863 0.1007 -0.0869 -0.1489 -0.1564 -0.2643 -0.2609 0.3786 0.0369 0.4024 0.0345 -0.2247 -0.2117 -0.2604 0.3064 -0.1079 -0.2346 0.3030 -0.2103 -0.2551 -0.1373 -0.1156 -0.1879 0.1149 0.1189 0.1664 0.0992 0.0918 0.1092 0.1034 0.0998 0.0957 0.1397 0.1445 0.1464 0.1589 0.1482 0.1570 0.1452 0.1591 0.1577 0.1578
va: 1.1813 1.2233 1.2252 1.2309 2.1319 2.0854 2.0930 3.1122 3.8698 3.7446 3.8580 4.0640 3.8967 3.8998 4.1905 4.3588 3.7323 3.5781 4.0742 3.9538 3.9672 3.7207 3.8946 4.0089 3.6758 3.9197 4.0169 3.8867 3.8773 3.9125 1.0467 1.0243 0.9942 1.0053 1.0035 1.0031 1.0042 1.0022 1.0143 1.0176 1.0058 1.0121 0.9888 1.0057 0.9994 1.0087 0.9902 0.9891 0.9905
dispcorr: -0.030056654 hartree
energy: -11427.175212113181
dipole: -157.58643 157.96411 0.37768 36.58600 -36.94015 -0.35415 -55.61738 54.40988 -1.20750
magnitude: 1.31382 au
magnitude: 3.33946 debye
