program: Orca
programVersion: 5.0.2
elementType: Br Br Br Br O O O N C C C C C C C C C C C C C C C C C C C C C C H H H H H H H H H H H H H H H H H H H
charge: 0
multiplicity: 1
keywords: wb97x-d3
keywords: def2-TZVPP
keywords: def2/J RIJCOSX
keywords: DEFGRID2
keywords: scfconv7
keywords: smallprint printgap noloewdin
keywords: NOSOSCF
formula: C22H19Br4NO3
InChI: InChI=1/C22H19Br4NO3/c1-21(2)17(19(23)22(24,25)26)18(21)20(28)30-16(12-27)13-7-6-10-15(11-13)29-14-8-4-3-5-9-14/h3-11,16-19H,1-2H3
49 atoms
Br 3.554967 -1.136636 -1.53852
Br 3.189792 0.828444 1.264623
Br 1.163933 -1.258152 2.449173
Br 4.062976 -2.161165 1.712647
O  -2.544269 -1.014195 0.55015
O  -1.537725 0.913479 0.024492
O  -5.508105 3.042962 -2.13391
N  -4.976076 -1.909712 2.58612
C  0.078417 -1.026373 -1.879944
C  0.905412 -0.616328 -0.702654
C  -0.47604 -1.174799 -0.472148
C  2.104417 -1.390389 -0.238869
C  0.339869 -2.324553 -2.604736
C  -0.416146 0.068367 -2.793869
C  -1.534495 -0.28981 0.044207
C  2.604351 -1.009809 1.165337
C  -3.708214 -0.301273 0.965232
C  -4.557385 0.070333 -0.225507
C  -4.412352 -1.213911 1.867517
C  -4.663329 1.40481 -0.585028
C  -5.164869 -0.920138 -0.990195
C  -5.362755 1.746793 -1.735902
C  -5.884041 -0.560723 -2.118178
C  -5.977354 0.768907 -2.503464
C  -4.461993 3.918364 -2.007122
C  -3.148001 3.547848 -2.269719
C  -4.773754 5.223311 -1.654283
C  -2.143637 4.498753 -2.161424
C  -3.759874 6.166379 -1.564389
C  -2.441488 5.808506 -1.809735
H  0.988092 0.459392 -0.582634
H  -0.542011 -2.202473 -0.132426
H  1.895339 -2.463585 -0.227845
H  1.098906 -2.194825 -3.376904
H  0.661671 -3.131266 -1.946262
H  -0.574574 -2.659515 -3.097511
H  0.286741 0.193868 -3.619296
H  -1.38605 -0.190473 -3.222448
H  -0.508749 1.033277 -2.299753
H  -3.44208 0.589039 1.543703
H  -4.194701 2.167249 0.024631
H  -5.084184 -1.964061 -0.712567
H  -6.366735 -1.323121 -2.715142
H  -6.525791 1.047533 -3.394519
H  -2.901474 2.533344 -2.558004
H  -5.802469 5.497614 -1.456143
H  -1.119861 4.208625 -2.36055
H  -4.005569 7.184729 -1.291953
H  -1.65232 6.544454 -1.729849
elementType: Br O N C H
nucrepener: 5592.85070665 hartree
twoeener: 9996.04691058 hartree
cpcmener: -0.03033962 hartree
xcener: -389.800774258189 hartree
chargesum: 0.0000000
charge: -0.079756 -0.011800 -0.011917 -0.001326 -0.267179 -0.436017 -0.328131 -0.085847 0.098639 -0.089481 -0.149996 -0.160146 -0.262600 -0.260232 0.396586 0.036778 0.404369 0.007656 -0.227411 -0.179967 -0.218123 0.268917 -0.127571 -0.221020 0.282579 -0.191399 -0.241801 -0.151354 -0.124633 -0.178370 0.120260 0.118101 0.167605 0.099047 0.092423 0.108808 0.101649 0.106671 0.084118 0.135954 0.144938 0.145477 0.160025 0.148644 0.159450 0.145037 0.157862 0.156883 0.157600
qa: -0.0798 -0.0118 -0.0119 -0.0013 -0.2672 -0.4360 -0.3281 -0.0858 0.0986 -0.0895 -0.1500 -0.1601 -0.2626 -0.2602 0.3966 0.0368 0.4044 0.0077 -0.2274 -0.1800 -0.2181 0.2689 -0.1276 -0.2210 0.2826 -0.1914 -0.2418 -0.1514 -0.1246 -0.1784 0.1203 0.1181 0.1676 0.0990 0.0924 0.1088 0.1016 0.1067 0.0841 0.1360 0.1449 0.1455 0.1600 0.1486 0.1595 0.1450 0.1579 0.1569 0.1576
va: 1.1845 1.2238 1.2269 1.2300 2.1330 2.0743 2.0871 3.1125 3.8554 3.7343 3.8828 4.0688 3.8989 3.9082 4.1565 4.3522 3.7460 3.5980 4.0672 3.9214 3.9897 3.7459 3.9110 4.0192 3.7104 3.8940 4.0014 3.9000 3.8886 3.9080 1.0420 1.0251 0.9931 1.0061 1.0043 1.0027 1.0047 0.9982 1.0157 1.0173 1.0127 1.0085 0.9894 1.0047 0.9907 1.0082 0.9912 0.9892 0.9904
dispcorr: -0.030839759 hartree
energy: -11427.176390583194
dipole: -147.75992 148.03403 0.27410 49.22563 -49.26466 -0.03904 -67.30265 65.47372 -1.82893
magnitude: 1.84977 au
magnitude: 4.70175 debye
