program: Orca
programVersion: 5.0.2
elementType: Br Br Br Br O O O N C C C C C C C C C C C C C C C C C C C C C C H H H H H H H H H H H H H H H H H H H
charge: 0
multiplicity: 1
keywords: wb97x-d3
keywords: def2-TZVPP
keywords: def2/J RIJCOSX
keywords: DEFGRID2
keywords: scfconv7
keywords: smallprint printgap noloewdin
keywords: NOSOSCF
formula: C22H19Br4NO3
InChI: InChI=1/C22H19Br4NO3/c1-21(2)17(19(23)22(24,25)26)18(21)20(28)30-16(12-27)13-7-6-10-15(11-13)29-14-8-4-3-5-9-14/h3-11,16-19H,1-2H3
49 atoms
Br 3.742758 -0.604407 -1.294961
Br 3.019497 0.169471 1.999151
Br 0.863613 -2.11156 2.033383
Br 3.834479 -2.793568 1.340693
O  -2.508756 -0.796719 0.199914
O  -1.422873 1.160075 0.232016
O  -5.490719 3.416965 -1.880926
N  -4.62646 -2.066051 2.388116
C  0.336136 -0.204858 -1.975865
C  1.02285 -0.272902 -0.650272
C  -0.403549 -0.759257 -0.769195
C  2.132505 -1.242372 -0.368028
C  0.637827 -1.215235 -3.05778
C  0.019009 1.162887 -2.528357
C  -1.460644 -0.00431 -0.071604
C  2.450887 -1.454699 1.121541
C  -3.633355 -0.202369 0.851601
C  -4.626026 0.297923 -0.167475
C  -4.187199 -1.256104 1.702956
C  -4.608916 1.645514 -0.503435
C  -5.490357 -0.579331 -0.811829
C  -5.445243 2.10624 -1.512301
C  -6.343908 -0.097418 -1.791651
C  -6.318342 1.239733 -2.15534
C  -4.351322 4.176871 -1.903547
C  -3.133183 3.682461 -2.3561
C  -4.476149 5.501835 -1.510767
C  -2.035079 4.529478 -2.401074
C  -3.371652 6.339282 -1.572797
C  -2.146071 5.857317 -2.01079
H  1.132902 0.691177 -0.16344
H  -0.558645 -1.831618 -0.799182
H  1.910267 -2.225107 -0.791584
H  -0.21918 -1.299859 -3.728138
H  1.492705 -0.8997 -3.656833
H  0.843736 -2.215306 -2.67655
H  -0.873515 1.128534 -3.155859
H  -0.131981 1.914432 -1.757533
H  0.848628 1.498119 -3.153414
H  -3.319167 0.611971 1.510967
H  -3.946008 2.324505 0.017818
H  -5.509934 -1.63063 -0.552569
H  -7.02843 -0.771854 -2.288829
H  -6.975231 1.613255 -2.930826
H  -3.032196 2.652972 -2.676927
H  -5.432765 5.873936 -1.165663
H  -1.086354 4.14453 -2.753239
H  -3.472653 7.373377 -1.269462
H  -1.284999 6.51128 -2.051096
elementType: Br O N C H
nucrepener: 5589.19386275 hartree
twoeener: 9992.36153706 hartree
cpcmener: -0.02937953 hartree
xcener: -389.799523848293 hartree
chargesum: -0.0000000
charge: -0.080022 -0.012204 -0.011034 -0.003068 -0.269003 -0.441098 -0.325795 -0.086161 0.117774 -0.092804 -0.169764 -0.157855 -0.259927 -0.287933 0.420168 0.038159 0.397243 -0.006104 -0.221370 -0.179241 -0.205289 0.276497 -0.124149 -0.230460 0.304315 -0.218104 -0.254962 -0.135633 -0.115153 -0.194001 0.122973 0.118076 0.167032 0.109108 0.098492 0.092950 0.107392 0.091125 0.103011 0.134656 0.145898 0.140533 0.160051 0.147997 0.162014 0.144984 0.165912 0.157353 0.157420
qa: -0.0800 -0.0122 -0.0110 -0.0031 -0.2690 -0.4411 -0.3258 -0.0862 0.1178 -0.0928 -0.1698 -0.1579 -0.2599 -0.2879 0.4202 0.0382 0.3972 -0.0061 -0.2214 -0.1792 -0.2053 0.2765 -0.1241 -0.2305 0.3043 -0.2181 -0.2550 -0.1356 -0.1152 -0.1940 0.1230 0.1181 0.1670 0.1091 0.0985 0.0930 0.1074 0.0911 0.1030 0.1347 0.1459 0.1405 0.1601 0.1480 0.1620 0.1450 0.1659 0.1574 0.1574
va: 1.1842 1.2209 1.2278 1.2282 2.1269 2.0685 2.0909 3.1106 3.8366 3.7332 3.9281 4.0682 3.9005 3.8995 4.1344 4.3406 3.7453 3.6848 4.0618 3.9097 3.9954 3.7473 3.9137 4.0270 3.7006 3.9187 4.0134 3.8740 3.8852 3.9371 1.0394 1.0242 0.9943 1.0022 1.0062 1.0048 0.9951 1.0143 1.0047 1.0213 1.0173 1.0096 0.9896 1.0054 0.9891 1.0086 0.9859 0.9887 0.9918
dispcorr: -0.030990314 hartree
energy: -11427.176142179595
dipole: -141.02685 141.15094 0.12410 72.99152 -72.54169 0.44983 -69.57425 67.43437 -2.13988
magnitude: 2.19016 au
magnitude: 5.56696 debye
