program: Orca
programVersion: 5.0.2
elementType: Br Br Br Br O O O N C C C C C C C C C C C C C C C C C C C C C C H H H H H H H H H H H H H H H H H H H
charge: 0
multiplicity: 1
keywords: wb97x-d3
keywords: def2-TZVPP
keywords: def2/J RIJCOSX
keywords: DEFGRID2
keywords: scfconv7
keywords: smallprint printgap noloewdin
keywords: NOSOSCF
formula: C22H19Br4NO3
InChI: InChI=1/C22H19Br4NO3/c1-21(2)17(19(23)22(24,25)26)18(21)20(28)30-16(12-27)13-7-6-10-15(11-13)29-14-8-4-3-5-9-14/h3-11,16-19H,1-2H3
49 atoms
Br 3.881577 -1.086648 0.189412
Br 1.747792 1.582383 0.493623
Br -0.434751 -0.29585 1.728416
Br 2.373927 -0.039958 3.112839
O  -2.229084 -2.724804 -0.793593
O  -1.359537 -1.168172 -2.139746
O  -3.78597 2.688405 -0.592298
N  -4.269009 -2.10563 -3.495219
C  1.333102 -2.753062 -1.546927
C  1.229931 -1.513691 -0.718504
C  0.073385 -2.488495 -0.744757
C  1.968348 -1.305249 0.570514
C  2.146546 -3.93665 -1.080956
C  1.341002 -2.58135 -3.045559
C  -1.20396 -2.037671 -1.322464
C  1.472651 -0.105292 1.398182
C  -3.549955 -2.229311 -0.986748
C  -3.755967 -0.948368 -0.21371
C  -3.907334 -2.134264 -2.405552
C  -3.736678 0.295962 -0.823985
C  -3.881793 -1.050015 1.169273
C  -3.801616 1.441153 -0.039147
C  -3.97653 0.100138 1.935946
C  -3.922681 1.35152 1.33847
C  -2.913761 2.97693 -1.607941
C  -1.637901 2.429604 -1.676343
C  -3.340853 3.894653 -2.557419
C  -0.796264 2.79996 -2.715007
C  -2.482297 4.266302 -3.581587
C  -1.21051 3.717309 -3.670511
H  1.080065 -0.612075 -1.304926
H  -0.03477 -3.127503 0.124513
H  1.891085 -2.19072 1.206753
H  1.746307 -4.85235 -1.519593
H  3.18462 -3.845315 -1.401828
H  2.13759 -4.068945 0.00111
H  2.36974 -2.477365 -3.394671
H  0.911711 -3.456066 -3.537024
H  0.792805 -1.703209 -3.379642
H  -4.189513 -3.010523 -0.568828
H  -3.661942 0.383675 -1.900652
H  -3.907685 -2.0226 1.645186
H  -4.081422 0.025385 3.010315
H  -3.976506 2.252133 1.936729
H  -1.295799 1.722259 -0.932051
H  -4.335958 4.316469 -2.491005
H  0.193791 2.366202 -2.773962
H  -2.817148 4.983603 -4.319719
H  -0.54701 4.002062 -4.476309
elementType: Br O N C H
nucrepener: 5992.14082189 hartree
cpcmener: -0.03225906 hartree
xcener: -389.807261215584 hartree
chargesum: 0.0000000
charge: -0.081381 -0.020209 -0.027360 -0.006288 -0.274558 -0.433927 -0.327153 -0.079796 0.090747 -0.100757 -0.087131 -0.168140 -0.262339 -0.261211 0.372845 0.083572 0.460874 -0.000240 -0.246584 -0.159028 -0.269506 0.245673 -0.133244 -0.196539 0.277323 -0.136230 -0.243220 -0.127058 -0.126240 -0.180596 0.115392 0.112684 0.165516 0.109251 0.099225 0.090536 0.099218 0.103028 0.094440 0.145616 0.143161 0.141632 0.159427 0.147256 0.086257 0.145310 0.146073 0.156429 0.157253
qa: -0.0814 -0.0202 -0.0274 -0.0063 -0.2746 -0.4339 -0.3272 -0.0798 0.0907 -0.1008 -0.0871 -0.1681 -0.2623 -0.2612 0.3728 0.0836 0.4609 -0.0002 -0.2466 -0.1590 -0.2695 0.2457 -0.1332 -0.1965 0.2773 -0.1362 -0.2432 -0.1271 -0.1262 -0.1806 0.1154 0.1127 0.1655 0.1093 0.0992 0.0905 0.0992 0.1030 0.0944 0.1456 0.1432 0.1416 0.1594 0.1473 0.0863 0.1453 0.1461 0.1564 0.1573
va: 1.1829 1.2208 1.2337 1.2289 2.1327 2.0596 2.0902 3.1061 3.8878 3.7467 3.8638 4.0730 3.8971 3.8971 4.1372 4.2916 3.8541 3.5679 4.0656 3.9131 3.9394 3.7974 3.8370 3.9789 3.7534 3.8796 3.9893 3.8803 3.8949 3.9262 1.0332 1.0297 0.9931 1.0030 1.0052 1.0038 1.0019 0.9999 1.0196 0.9918 1.0164 1.0088 0.9901 1.0036 1.0282 1.0083 0.9955 0.9891 0.9907
dispcorr: -0.035532380 hartree
energy: -11427.178211222470
dipole: -84.12674 84.65623 0.52949 -13.43649 11.86676 -1.56973 -72.68806 74.52037 1.83231
magnitude: 2.47018 au
magnitude: 6.27869 debye
