program: Orca
programVersion: 5.0.2
elementType: Br Br Br Br O O O N C C C C C C C C C C C C C C C C C C C C C C H H H H H H H H H H H H H H H H H H H
charge: 0
multiplicity: 1
keywords: wb97x-d3
keywords: def2-TZVPP
keywords: def2/J RIJCOSX
keywords: DEFGRID2
keywords: scfconv7
keywords: smallprint printgap noloewdin
keywords: NOSOSCF
formula: C22H19Br4NO3
InChI: InChI=1/C22H19Br4NO3/c1-21(2)17(19(23)22(24,25)26)18(21)20(28)30-16(12-27)13-7-6-10-15(11-13)29-14-8-4-3-5-9-14/h3-11,16-19H,1-2H3
49 atoms
Br 3.954568 -2.708401 1.041066
Br 2.672514 -2.1096 -2.127994
Br 1.093971 0.34714 -0.98422
Br 4.204968 0.235307 -0.693427
O  -2.151314 -0.826891 0.786132
O  -1.629629 -2.826092 -0.05232
O  -3.678507 3.913358 0.93711
N  -2.935297 -0.765982 -2.511971
C  0.621637 -2.789445 2.155487
C  1.168016 -2.334349 0.841682
C  -0.086102 -1.687865 1.387825
C  2.423953 -1.52727 0.70134
C  1.256633 -2.350433 3.453726
C  0.046346 -4.182128 2.225731
C  -1.33782 -1.884041 0.638201
C  2.597523 -0.845582 -0.668218
C  -3.37496 -0.84595 0.068097
C  -4.180326 0.365995 0.464719
C  -3.10868 -0.817558 -1.377514
C  -3.581613 1.618773 0.506302
C  -5.530176 0.22002 0.749256
C  -4.340529 2.72596 0.855185
C  -6.278956 1.33868 1.086233
C  -5.694468 2.593027 1.148358
C  -4.347001 5.087191 0.699013
C  -5.051856 5.28798 -0.48082
C  -4.246851 6.091424 1.649117
C  -5.666533 6.511585 -0.700225
C  -4.857593 7.315246 1.411513
C  -5.572614 7.528217 0.241735
H  0.995624 -3.038729 0.034009
H  0.023369 -0.702142 1.825586
H  2.474876 -0.743696 1.462395
H  1.65335 -1.335631 3.421494
H  0.514021 -2.377961 4.253098
H  2.068004 -3.022069 3.736049
H  -0.76378 -4.229727 2.955688
H  -0.335228 -4.539824 1.272471
H  0.822309 -4.877976 2.549217
H  -3.943577 -1.756148 0.282626
H  -2.531569 1.748544 0.272711
H  -5.99481 -0.757081 0.712263
H  -7.330862 1.232063 1.315953
H  -6.291181 3.450927 1.430275
H  -5.117525 4.502924 -1.224371
H  -3.691934 5.918315 2.562724
H  -6.216171 6.671403 -1.618843
H  -4.777303 8.101616 2.15095
H  -6.050819 8.48204 0.061817
elementType: Br O N C H
nucrepener: 5506.25887303 hartree
twoeener: 9910.86135574 hartree
cpcmener: -0.03299506 hartree
xcener: -389.800766269305 hartree
chargesum: -0.0000000
charge: -0.079663 -0.010568 -0.017675 -0.002460 -0.270888 -0.430143 -0.325220 -0.083320 0.102919 -0.110811 -0.132301 -0.147673 -0.259069 -0.263189 0.379552 0.044261 0.418568 0.011150 -0.242806 -0.210019 -0.187606 0.216554 -0.144750 -0.164820 0.244375 -0.171451 -0.221668 -0.148717 -0.133061 -0.169841 0.123135 0.117776 0.165420 0.091115 0.108725 0.099117 0.103374 0.096159 0.097419 0.131005 0.132952 0.145334 0.160107 0.156704 0.159723 0.146378 0.159314 0.157596 0.158985
qa: -0.0797 -0.0106 -0.0177 -0.0025 -0.2709 -0.4301 -0.3252 -0.0833 0.1029 -0.1108 -0.1323 -0.1477 -0.2591 -0.2632 0.3796 0.0443 0.4186 0.0112 -0.2428 -0.2100 -0.1876 0.2166 -0.1447 -0.1648 0.2444 -0.1715 -0.2217 -0.1487 -0.1331 -0.1698 0.1231 0.1178 0.1654 0.0911 0.1087 0.0991 0.1034 0.0962 0.0974 0.1310 0.1330 0.1453 0.1601 0.1567 0.1597 0.1464 0.1593 0.1576 0.1590
va: 1.1844 1.2232 1.2282 1.2304 2.1570 2.0745 2.0752 3.1096 3.8600 3.7486 3.9103 4.0580 3.9039 3.8976 4.1676 4.3401 3.7362 3.7382 4.0180 4.0670 3.9605 3.8370 3.9212 3.8895 3.7141 3.9195 4.0003 3.8919 3.8892 3.8935 1.0418 1.0219 0.9951 1.0040 1.0027 1.0059 0.9997 1.0182 1.0022 1.0195 1.0275 1.0028 0.9915 0.9961 0.9951 1.0066 0.9904 0.9896 0.9900
dispcorr: -0.028763818 hartree
energy: -11427.174676483784
dipole: -151.52365 150.00602 -1.51763 51.18510 -50.27608 0.90902 51.53143 -48.54333 2.98810
magnitude: 3.47250 au
magnitude: 8.82640 debye
