program: Orca
programVersion: 5.0.2
elementType: Br Br Br Br O O O N C C C C C C C C C C C C C C C C C C C C C C H H H H H H H H H H H H H H H H H H H
charge: 0
multiplicity: 1
keywords: wb97x-d3
keywords: def2-TZVPP
keywords: def2/J RIJCOSX
keywords: DEFGRID2
keywords: scfconv7
keywords: smallprint printgap noloewdin
keywords: NOSOSCF
formula: C22H19Br4NO3
InChI: InChI=1/C22H19Br4NO3/c1-21(2)17(19(23)22(24,25)26)18(21)20(28)30-16(12-27)13-7-6-10-15(11-13)29-14-8-4-3-5-9-14/h3-11,16-19H,1-2H3
49 atoms
Br 4.014893 -1.67924 -0.753706
Br 3.192601 -0.379153 2.35851
Br 0.70177 -2.287404 2.438465
Br 3.570069 -3.493086 2.112016
O  -2.335151 -0.634756 -0.166304
O  -0.866197 1.010889 0.207241
O  -3.816605 4.749473 -1.677352
N  -5.494875 -1.19702 0.633552
C  0.807606 -0.81991 -1.777939
C  1.354953 -0.841883 -0.385484
C  -0.10877 -1.111419 -0.601714
C  2.269546 -1.927974 0.100084
C  1.040749 -1.976194 -2.722008
C  0.755541 0.513048 -2.48445
C  -1.094701 -0.11449 -0.136193
C  2.443255 -1.996603 1.62621
C  -3.394528 0.269132 0.118045
C  -3.669093 1.192833 -1.044887
C  -4.561817 -0.567793 0.404728
C  -3.641849 2.563891 -0.853576
C  -3.948583 0.66393 -2.299301
C  -3.90243 3.414724 -1.919239
C  -4.195422 1.52196 -3.357526
C  -4.174846 2.896976 -3.178943
C  -4.698807 5.61132 -2.266253
C  -4.196797 6.82215 -2.719179
C  -6.056038 5.329117 -2.360695
C  -5.061159 7.758137 -3.266075
C  -6.906658 6.270692 -2.918897
C  -6.41664 7.486033 -3.374199
H  1.577608 0.141503 0.016556
H  -0.447157 -2.139633 -0.538547
H  1.919943 -2.912099 -0.222056
H  1.055463 -2.94633 -2.225238
H  0.243524 -2.01035 -3.465917
H  1.986338 -1.860167 -3.251609
H  1.692276 0.675013 -3.019424
H  -0.054341 0.532306 -3.215686
H  0.613547 1.350343 -1.805712
H  -3.172048 0.856065 1.015147
H  -3.4081 2.984565 0.116277
H  -3.980215 -0.407547 -2.450085
H  -4.409419 1.118843 -4.338209
H  -4.367729 3.557856 -4.013958
H  -3.137753 7.026408 -2.632663
H  -6.450054 4.389324 -1.995575
H  -4.667966 8.703639 -3.615257
H  -7.963949 6.051966 -2.989324
H  -7.08728 8.216853 -3.804956
nucrepener: 5416.18202305 hartree
twoeener: 9819.67253220 hartree
xcener: -389.811382793556 hartree
chargesum: -0.0000000
charge: -0.060696 0.002175 -0.007047 0.008649 -0.258391 -0.358313 -0.296081 0.000465 0.073335 -0.066310 -0.165314 -0.182022 -0.245940 -0.242426 0.348433 0.034914 0.315751 0.035964 -0.254823 -0.148051 -0.200907 0.184442 -0.109030 -0.138347 0.231141 -0.206033 -0.153319 -0.092970 -0.119533 -0.141347 0.121969 0.102801 0.149073 0.076234 0.102482 0.100369 0.096756 0.089526 0.101268 0.120065 0.112602 0.125685 0.131539 0.137033 0.127499 0.134193 0.126261 0.129076 0.127199
qa: -0.0607 0.0022 -0.0070 0.0086 -0.2584 -0.3583 -0.2961 0.0005 0.0733 -0.0663 -0.1653 -0.1820 -0.2459 -0.2424 0.3484 0.0349 0.3158 0.0360 -0.2548 -0.1481 -0.2009 0.1844 -0.1090 -0.1383 0.2311 -0.2060 -0.1533 -0.0930 -0.1195 -0.1413 0.1220 0.1028 0.1491 0.0762 0.1025 0.1004 0.0968 0.0895 0.1013 0.1201 0.1126 0.1257 0.1315 0.1370 0.1275 0.1342 0.1263 0.1291 0.1272
va: 1.2029 1.2350 1.2339 1.2413 2.1274 2.1504 2.1076 3.1199 3.8916 3.7019 3.9116 4.1179 3.9002 3.9047 4.2263 4.3581 3.8360 3.6303 4.0221 4.0558 4.0236 3.9288 3.9460 3.9473 3.8090 4.0335 3.9345 3.9377 3.9514 3.9584 1.0448 1.0279 1.0037 1.0082 1.0049 1.0089 1.0041 1.0032 1.0201 1.0184 1.0278 1.0185 1.0002 1.0017 1.0132 1.0036 0.9988 0.9997 1.0000
dispcorr: -0.029048950 hartree
energy: -11427.142845123135
dipole: -144.33920 144.50167 0.16247 103.78735 -103.16703 0.62032 -96.80199 95.23541 -1.56658
magnitude: 1.69274 au
magnitude: 4.30260 debye
