program: Orca
programVersion: 5.0.2
elementType: Br Br Br Br O O O N C C C C C C C C C C C C C C C C C C C C C C H H H H H H H H H H H H H H H H H H H
charge: 0
multiplicity: 1
keywords: wb97x-d3
keywords: def2-TZVPP
keywords: def2/J RIJCOSX
keywords: DEFGRID2
keywords: scfconv7
keywords: smallprint printgap noloewdin
keywords: NOSOSCF
formula: C22H19Br4NO3
InChI: InChI=1/C22H19Br4NO3/c1-21(2)17(19(23)22(24,25)26)18(21)20(28)30-16(12-27)13-7-6-10-15(11-13)29-14-8-4-3-5-9-14/h3-11,16-19H,1-2H3
49 atoms
Br 3.412617 -1.895326 -1.571262
Br 0.848853 0.439966 -1.828804
Br 0.830779 0.677512 1.30507
Br 3.455713 1.276877 -0.279943
O  -1.660414 -2.703238 0.510087
O  -1.389227 -2.233959 2.685008
O  -3.421676 2.325968 1.24312
N  -4.245067 -4.378668 -0.705166
C  1.246747 -3.683634 0.538412
C  1.130985 -2.284693 0.024955
C  0.531288 -2.63456 1.367521
C  2.289722 -1.336694 -0.067588
C  2.548745 -4.177653 1.127968
C  0.502365 -4.769305 -0.201968
C  -0.921279 -2.51006 1.615758
C  1.891859 0.1406 -0.230309
C  -3.060875 -2.443032 0.588314
C  -3.348091 -1.078856 0.012718
C  -3.719508 -3.525887 -0.143422
C  -3.280141 0.017571 0.863688
C  -3.581841 -0.895597 -1.342879
C  -3.454169 1.295846 0.356725
C  -3.766075 0.387243 -1.836409
C  -3.706938 1.486431 -0.997035
C  -2.727742 3.466826 0.952783
C  -1.581676 3.472025 0.167592
C  -3.189814 4.640638 1.531935
C  -0.902653 4.664115 -0.033335
C  -2.496258 5.822368 1.326921
C  -1.353079 5.842838 0.540958
H  0.413834 -2.175019 -0.781392
H  1.087863 -2.316507 2.241524
H  2.925072 -1.396139 0.819844
H  2.355303 -5.01036 1.805345
H  3.217355 -4.53338 0.343937
H  3.082065 -3.418483 1.700314
H  0.221632 -5.577321 0.475085
H  -0.398559 -4.416872 -0.69592
H  1.153533 -5.190862 -0.968881
H  -3.396138 -2.491213 1.628286
H  -3.08827 -0.112145 1.921648
H  -3.637509 -1.743406 -2.013506
H  -3.966507 0.533208 -2.889252
H  -3.859676 2.48306 -1.39043
H  -1.209766 2.559831 -0.279513
H  -4.081928 4.618851 2.14392
H  -0.007397 4.661693 -0.640974
H  -2.857516 6.734665 1.782862
H  -0.816189 6.767951 0.381894
nucrepener: 5951.28250470 hartree
xcener: -389.813354257429 hartree
chargesum: 0.0000000
charge: -0.058443 -0.010521 -0.005560 0.010271 -0.257708 -0.347947 -0.295203 -0.000729 0.084686 -0.092468 -0.146069 -0.166054 -0.244871 -0.240035 0.342021 0.047618 0.284420 0.034848 -0.264073 -0.208163 -0.163164 0.226604 -0.115766 -0.146455 0.291292 -0.164284 -0.213892 -0.130452 -0.091190 -0.140069 0.119660 0.106018 0.151241 0.104835 0.099485 0.074597 0.096615 0.091867 0.093938 0.131708 0.131699 0.122587 0.132215 0.137208 0.087343 0.125323 0.124644 0.125082 0.125294
qa: -0.0584 -0.0105 -0.0056 0.0103 -0.2577 -0.3479 -0.2952 -0.0007 0.0847 -0.0925 -0.1461 -0.1661 -0.2449 -0.2400 0.3420 0.0476 0.2844 0.0348 -0.2641 -0.2082 -0.1632 0.2266 -0.1158 -0.1465 0.2913 -0.1643 -0.2139 -0.1305 -0.0912 -0.1401 0.1197 0.1060 0.1512 0.1048 0.0995 0.0746 0.0966 0.0919 0.0939 0.1317 0.1317 0.1226 0.1322 0.1372 0.0873 0.1253 0.1246 0.1251 0.1253
va: 1.2047 1.2260 1.2302 1.2439 2.0874 2.1545 2.1154 3.1081 3.8623 3.6872 3.9031 4.0969 3.9100 3.9097 4.2452 4.3178 3.8265 3.6815 4.0206 4.0013 4.0202 3.8754 3.9523 3.9540 3.7386 3.9095 4.0269 3.9875 3.9399 3.9629 1.0396 1.0235 1.0010 1.0046 1.0086 1.0090 1.0028 1.0176 1.0041 1.0237 1.0299 1.0188 1.0004 1.0009 1.0294 1.0148 1.0027 0.9988 1.0001
dispcorr: -0.034218301 hartree
energy: -11427.146658219284
dipole: -87.63493 88.55927 0.92435 -15.56375 16.24002 0.67627 25.93392 -25.99483 -0.06090
magnitude: 1.14694 au
magnitude: 2.91528 debye
