program: Orca
programVersion: 5.0.2
elementType: Br Br Br Br O O O N C C C C C C C C C C C C C C C C C C C C C C H H H H H H H H H H H H H H H H H H H
charge: 0
multiplicity: 1
keywords: wb97x-d3
keywords: def2-TZVPP
keywords: def2/J RIJCOSX
keywords: DEFGRID2
keywords: scfconv7
keywords: smallprint printgap noloewdin
keywords: NOSOSCF
formula: C22H19Br4NO3
InChI: InChI=1/C22H19Br4NO3/c1-21(2)17(19(23)22(24,25)26)18(21)20(28)30-16(12-27)13-7-6-10-15(11-13)29-14-8-4-3-5-9-14/h3-11,16-19H,1-2H3
49 atoms
Br 3.118568 -3.167341 -0.999066
Br 3.835425 0.133417 -0.233499
Br 2.017635 -0.112122 2.316936
Br 4.446818 -2.044954 1.951103
O  -2.09396 0.048161 1.063695
O  -0.922778 0.777303 -0.698472
O  -5.589041 2.915279 -2.833782
N  -4.249832 1.421185 3.176327
C  -0.254553 -2.326973 -0.813642
C  0.928454 -1.510272 -0.396833
C  -0.381317 -1.322704 0.319261
C  2.105773 -2.116746 0.308216
C  -0.373941 -3.778318 -0.409285
C  -0.85763 -2.043054 -2.167921
C  -1.117812 -0.055116 0.140735
C  3.041286 -1.113272 1.00266
C  -2.965707 1.155719 0.916863
C  -3.956777 0.961347 -0.20837
C  -3.671277 1.284874 2.193737
C  -4.288578 2.045562 -1.002826
C  -4.547953 -0.277661 -0.418741
C  -5.237162 1.896084 -2.007946
C  -5.469117 -0.420654 -1.443568
C  -5.824372 0.659705 -2.235081
C  -5.659659 4.191066 -2.344113
C  -5.121881 5.205958 -3.120177
C  -6.291062 4.478959 -1.140266
C  -5.220268 6.520104 -2.687998
C  -6.371152 5.795446 -0.714999
C  -5.838189 6.82039 -1.483613
H  1.183442 -0.713568 -1.088693
H  -0.486426 -1.765676 1.303194
H  1.783177 -2.82671 1.073774
H  -1.424223 -4.07295 -0.395569
H  0.143535 -4.423114 -1.119721
H  0.028226 -3.986801 0.582089
H  -0.743561 -1.006738 -2.476314
H  -0.371402 -2.667794 -2.918397
H  -1.922872 -2.280129 -2.175789
H  -2.397199 2.077262 0.750959
H  -3.806798 3.002743 -0.844668
H  -4.29875 -1.122702 0.20908
H  -5.932659 -1.382176 -1.618564
H  -6.553518 0.553404 -3.027161
H  -4.636522 4.963189 -4.056224
H  -6.718778 3.686251 -0.539689
H  -4.802837 7.311755 -3.295822
H  -6.860879 6.019063 0.223448
H  -5.907428 7.845713 -1.146856
nucrepener: 5454.23469288 hartree
twoeener: 9857.63357566 hartree
xcener: -389.812514503636 hartree
chargesum: -0.0000000
charge: -0.060081 0.002706 -0.006455 0.008702 -0.264643 -0.351677 -0.297323 0.000942 0.074688 -0.064086 -0.164389 -0.184697 -0.245654 -0.240306 0.332686 0.033677 0.306386 0.073912 -0.252030 -0.143861 -0.218621 0.205008 -0.090214 -0.186635 0.232274 -0.206042 -0.162494 -0.091772 -0.114021 -0.142500 0.121952 0.103504 0.150042 0.101432 0.101455 0.076654 0.102289 0.098423 0.085579 0.123632 0.114511 0.126348 0.128867 0.130143 0.127702 0.137299 0.127538 0.131502 0.127650
qa: -0.0601 0.0027 -0.0065 0.0087 -0.2646 -0.3517 -0.2973 0.0009 0.0747 -0.0641 -0.1644 -0.1847 -0.2457 -0.2403 0.3327 0.0337 0.3064 0.0739 -0.2520 -0.1439 -0.2186 0.2050 -0.0902 -0.1866 0.2323 -0.2060 -0.1625 -0.0918 -0.1140 -0.1425 0.1220 0.1035 0.1500 0.1014 0.1015 0.0767 0.1023 0.0984 0.0856 0.1236 0.1145 0.1263 0.1289 0.1301 0.1277 0.1373 0.1275 0.1315 0.1276
va: 1.2032 1.2355 1.2344 1.2413 2.1129 2.1548 2.1123 3.1216 3.8882 3.7053 3.9017 4.1184 3.9000 3.9021 4.2370 4.3569 3.8355 3.6365 4.0166 3.9831 4.0067 3.8822 3.9404 4.0341 3.8087 4.0405 3.9462 3.9324 3.9485 3.9609 1.0444 1.0275 1.0030 1.0053 1.0089 1.0085 1.0200 1.0044 1.0050 1.0212 1.0147 1.0190 0.9990 1.0107 1.0130 1.0024 0.9986 0.9991 1.0000
dispcorr: -0.029384502 hartree
energy: -11427.142807377151
dipole: -174.81034 174.48148 -0.32886 56.53150 -57.04095 -0.50945 -47.08635 46.16860 -0.91775
magnitude: 1.09998 au
magnitude: 2.79593 debye
