program: Orca
programVersion: 5.0.2
elementType: Br Br Br Br O O O N C C C C C C C C C C C C C C C C C C C C C C H H H H H H H H H H H H H H H H H H H
charge: 0
multiplicity: 1
keywords: wb97x-d3
keywords: def2-TZVPP
keywords: def2/J RIJCOSX
keywords: DEFGRID2
keywords: scfconv7
keywords: smallprint printgap noloewdin
keywords: NOSOSCF
formula: C22H19Br4NO3
InChI: InChI=1/C22H19Br4NO3/c1-21(2)17(19(23)22(24,25)26)18(21)20(28)30-16(12-27)13-7-6-10-15(11-13)29-14-8-4-3-5-9-14/h3-11,16-19H,1-2H3
49 atoms
Br 3.354607 -2.173437 2.207044
Br 2.015694 -3.810334 -0.539934
Br 1.630341 -1.024735 -1.944365
Br 4.480927 -1.916531 -1.019374
O  -1.677225 0.802452 -0.46778
O  -1.933784 -1.241818 0.409387
O  -5.361113 4.152512 1.542532
N  -2.934306 2.265543 -3.153938
C  0.418976 -0.277634 2.272491
C  0.913558 -1.196957 1.202548
C  0.071973 -0.005882 0.819631
C  2.35409 -1.26793 0.788085
C  1.345113 0.729469 2.913935
C  -0.616775 -0.814065 3.23119
C  -1.273264 -0.250894 0.260866
C  2.603168 -1.974706 -0.555263
C  -2.97585 0.717483 -1.049257
C  -4.049797 1.13997 -0.076954
C  -2.938283 1.588861 -2.226059
C  -4.194547 2.483256 0.249452
C  -4.85998 0.179622 0.511095
C  -5.1745 2.864638 1.154918
C  -5.825511 0.572329 1.426215
C  -5.991969 1.907762 1.745683
C  -5.13025 5.182023 0.671387
C  -5.585386 5.154107 -0.640695
C  -4.469994 6.295723 1.166843
C  -5.362046 6.251209 -1.457632
C  -4.265098 7.391255 0.341916
C  -4.703834 7.372266 -0.973124
H  0.39032 -2.147148 1.163315
H  0.584926 0.845552 0.38741
H  2.79046 -0.269271 0.706504
H  1.889173 0.279515 3.74448
H  2.078857 1.14723 2.224418
H  0.764939 1.565023 3.307842
H  -0.115704 -1.281864 4.079823
H  -1.240695 -0.006195 3.616802
H  -1.269624 -1.556688 2.780144
H  -3.172381 -0.302189 -1.3945
H  -3.556656 3.229152 -0.210009
H  -4.731806 -0.865633 0.265767
H  -6.462492 -0.169717 1.88832
H  -6.75171 2.220506 2.449723
H  -6.10817 4.287861 -1.025381
H  -4.128606 6.301002 2.193585
H  -5.710921 6.227045 -2.481306
H  -3.752703 8.261127 0.730939
H  -4.536278 8.224945 -1.616784
nucrepener: 5476.41271620 hartree
twoeener: 9880.08705256 hartree
xcener: -389.811938333093 hartree
chargesum: 0.0000000
charge: -0.060253 0.001637 -0.005045 0.009056 -0.257231 -0.379744 -0.297755 -0.001857 0.073018 -0.075869 -0.168616 -0.176648 -0.243743 -0.246299 0.380209 0.034100 0.329528 0.004237 -0.268247 -0.182901 -0.134827 0.214836 -0.094980 -0.199059 0.248474 -0.167680 -0.214513 -0.099725 -0.088820 -0.145237 0.121975 0.102407 0.149579 0.100123 0.075266 0.103737 0.094919 0.092894 0.100182 0.124674 0.130298 0.120709 0.129438 0.129390 0.132305 0.124616 0.129202 0.125661 0.126581
qa: -0.0603 0.0016 -0.0050 0.0091 -0.2572 -0.3797 -0.2978 -0.0019 0.0730 -0.0759 -0.1686 -0.1766 -0.2437 -0.2463 0.3802 0.0341 0.3295 0.0042 -0.2682 -0.1829 -0.1348 0.2148 -0.0950 -0.1991 0.2485 -0.1677 -0.2145 -0.0997 -0.0888 -0.1452 0.1220 0.1024 0.1496 0.1001 0.0753 0.1037 0.0949 0.0929 0.1002 0.1247 0.1303 0.1207 0.1294 0.1294 0.1323 0.1246 0.1292 0.1257 0.1266
va: 1.2028 1.2353 1.2378 1.2412 2.1295 2.1259 2.1150 3.1166 3.8845 3.6992 3.9351 4.1127 3.9028 3.9064 4.1760 4.3530 3.8308 3.6586 4.0282 3.9828 3.9829 3.8630 3.9552 4.0361 3.7949 3.9542 4.0461 3.9497 3.9326 3.9666 1.0450 1.0283 1.0028 1.0083 1.0086 1.0051 1.0037 1.0016 1.0214 1.0167 1.0150 1.0216 0.9994 1.0114 1.0037 1.0139 0.9998 0.9988 1.0003
dispcorr: -0.029138449 hartree
energy: -11427.144125003784
dipole: -147.93976 147.66078 -0.27898 115.05887 -114.71435 0.34452 34.61550 -33.38503 1.23048
magnitude: 1.30790 au
magnitude: 3.32441 debye
