program: Orca
programVersion: 5.0.2
elementType: Br Br Br Br O O O N C C C C C C C C C C C C C C C C C C C C C C H H H H H H H H H H H H H H H H H H H
charge: 0
multiplicity: 1
keywords: wb97x-d3
keywords: def2-TZVPP
keywords: def2/J RIJCOSX
keywords: DEFGRID2
keywords: scfconv7
keywords: smallprint printgap noloewdin
keywords: NOSOSCF
formula: C22H19Br4NO3
InChI: InChI=1/C22H19Br4NO3/c1-21(2)17(19(23)22(24,25)26)18(21)20(28)30-16(12-27)13-7-6-10-15(11-13)29-14-8-4-3-5-9-14/h3-11,16-19H,1-2H3
49 atoms
Br 3.459935 -1.829765 2.165232
Br 2.021852 -3.736321 -0.350429
Br 1.494276 -1.104874 -1.978829
Br 4.409583 -1.847117 -1.127938
O  -1.744814 0.754135 -0.567164
O  -1.939947 -1.175552 0.551117
O  -5.281208 4.209648 1.408187
N  -3.155955 1.912446 -3.328853
C  0.472029 0.006761 2.204815
C  0.944706 -0.998668 1.20487
C  0.054822 0.131057 0.750646
C  2.364757 -1.077134 0.726836
C  1.398053 1.0915 2.704761
C  -0.504159 -0.460195 3.256898
C  -1.30159 -0.199417 0.269155
C  2.561382 -1.897291 -0.55973
C  -3.063478 0.588199 -1.078204
C  -4.101628 1.087699 -0.104134
C  -3.09914 1.337065 -2.336554
C  -4.197423 2.449432 0.159992
C  -4.922892 0.181329 0.548004
C  -5.14251 2.902248 1.069437
C  -5.856873 0.64577 1.462653
C  -5.975287 1.998882 1.721557
C  -5.00464 5.201989 0.508185
C  -4.300235 6.301179 0.97495
C  -5.458584 5.157151 -0.80381
C  -4.050489 7.365287 0.121832
C  -5.190538 6.222499 -1.649021
C  -4.488585 7.329067 -1.193101
H  0.445665 -1.959727 1.280044
H  0.526477 0.948563 0.217554
H  2.771305 -0.08139 0.532177
H  1.991309 0.735614 3.547165
H  2.087757 1.456748 1.943939
H  0.81385 1.94745 3.045382
H  -1.154379 -1.259806 2.911466
H  0.047771 -0.82917 4.122588
H  -1.134814 0.364998 3.591227
H  -3.253085 -0.464204 -1.311107
H  -3.546328 3.151019 -0.348208
H  -4.82738 -0.878044 0.35286
H  -6.503684 -0.053936 1.974423
H  -6.70799 2.367626 2.427096
H  -3.961129 6.320507 2.002304
H  -6.015767 4.302928 -1.166502
H  -3.504518 8.224123 0.489123
H  -5.539472 6.185361 -2.672289
H  -4.287021 8.157378 -1.858463
nucrepener: 5490.11386211 hartree
twoeener: 9893.76509332 hartree
xcener: -389.811897926105 hartree
chargesum: 0.0000000
charge: -0.060152 0.000596 -0.004763 0.008854 -0.259195 -0.376511 -0.297025 -0.001880 0.076048 -0.080603 -0.165584 -0.173036 -0.242663 -0.245533 0.373153 0.033864 0.332347 0.007000 -0.267728 -0.196834 -0.132317 0.227830 -0.091803 -0.203619 0.256941 -0.217116 -0.177081 -0.088212 -0.099273 -0.146104 0.121788 0.102590 0.149570 0.100438 0.074896 0.103112 0.099757 0.095243 0.092448 0.122141 0.131164 0.117246 0.129110 0.129033 0.124593 0.134424 0.126006 0.130006 0.126833
qa: -0.0602 0.0006 -0.0048 0.0089 -0.2592 -0.3765 -0.2970 -0.0019 0.0760 -0.0806 -0.1656 -0.1730 -0.2427 -0.2455 0.3732 0.0339 0.3323 0.0070 -0.2677 -0.1968 -0.1323 0.2278 -0.0918 -0.2036 0.2569 -0.2171 -0.1771 -0.0882 -0.0993 -0.1461 0.1218 0.1026 0.1496 0.1004 0.0749 0.1031 0.0998 0.0952 0.0924 0.1221 0.1312 0.1172 0.1291 0.1290 0.1246 0.1344 0.1260 0.1300 0.1268
va: 1.2023 1.2343 1.2382 1.2413 2.1288 2.1306 2.1173 3.1178 3.8843 3.7052 3.9351 4.1100 3.9030 3.9069 4.1802 4.3529 3.8359 3.6565 4.0254 3.9835 3.9869 3.8535 3.9539 4.0364 3.7862 4.0484 3.9589 3.9306 3.9469 3.9665 1.0449 1.0281 1.0026 1.0082 1.0086 1.0054 1.0215 1.0031 1.0018 1.0180 1.0156 1.0208 0.9994 1.0119 1.0141 1.0032 0.9987 0.9995 1.0003
dispcorr: -0.029167490 hartree
energy: -11427.143993132957
dipole: -145.81871 145.61632 -0.20239 115.13257 -114.64539 0.48718 32.16086 -30.92564 1.23522
magnitude: 1.34315 au
magnitude: 3.41403 debye
