program: Orca
programVersion: 5.0.2
elementType: Br Br Br Br O O O N C C C C C C C C C C C C C C C C C C C C C C H H H H H H H H H H H H H H H H H H H
charge: 0
multiplicity: 1
keywords: wb97x-d3
keywords: def2-TZVPP
keywords: def2/J RIJCOSX
keywords: DEFGRID2
keywords: scfconv7
keywords: smallprint printgap noloewdin
keywords: NOSOSCF
formula: C22H19Br4NO3
InChI: InChI=1/C22H19Br4NO3/c1-21(2)17(19(23)22(24,25)26)18(21)20(28)30-16(12-27)13-7-6-10-15(11-13)29-14-8-4-3-5-9-14/h3-11,16-19H,1-2H3
49 atoms
Br 3.48691 -1.655383 2.203908
Br 2.044808 -3.787319 -0.101302
Br 1.504426 -1.328469 -1.980645
Br 4.426756 -1.978114 -1.078106
O  -1.755231 0.75217 -0.658109
O  -1.909468 -1.130931 0.542787
O  -5.158905 4.289163 1.380871
N  -3.302754 1.840945 -3.375641
C  0.514983 0.188912 2.082384
C  0.973047 -0.905322 1.173188
C  0.088115 0.184785 0.625275
C  2.391532 -1.036793 0.702709
C  1.449598 1.308201 2.47773
C  -0.457734 -0.177136 3.176616
C  -1.281487 -0.168075 0.198924
C  2.581885 -1.978596 -0.498302
C  -3.097367 0.575339 -1.099298
C  -4.086798 1.111605 -0.094005
C  -3.194116 1.28845 -2.374726
C  -4.150652 2.48061 0.140397
C  -4.89682 0.235423 0.610933
C  -5.053955 2.971077 1.072247
C  -5.788718 0.73742 1.54778
C  -5.875893 2.098253 1.777554
C  -4.901343 5.250381 0.441919
C  -4.150499 6.344484 0.843625
C  -5.415769 5.179308 -0.846503
C  -3.915602 7.377485 -0.051132
C  -5.162443 6.213241 -1.734079
C  -4.414491 7.314662 -1.343265
H  0.468178 -1.852253 1.336951
H  0.559385 0.949097 0.017962
H  2.80347 -0.066722 0.413168
H  2.047068 1.026133 3.34474
H  2.135959 1.599992 1.682851
H  0.87193 2.194487 2.743498
H  -1.083969 0.676775 3.439587
H  -1.112434 -1.001363 2.90526
H  0.096419 -0.471846 4.068893
H  -3.301465 -0.482768 -1.290454
H  -3.508651 3.159047 -0.409066
H  -4.826392 -0.829858 0.438276
H  -6.426781 0.061119 2.100365
H  -6.575663 2.496513 2.500266
H  -3.763802 6.384578 1.853407
H  -6.008111 4.328603 -1.158227
H  -3.33295 8.232467 0.265303
H  -5.558588 6.155475 -2.739028
H  -4.224298 8.118475 -2.041241
nucrepener: 5488.10579678 hartree
twoeener: 9891.74655995 hartree
xcener: -389.812094236880 hartree
chargesum: 0.0000000
charge: -0.060462 0.000610 -0.005290 0.008659 -0.259400 -0.373989 -0.297248 -0.001784 0.073412 -0.076015 -0.167277 -0.174940 -0.243463 -0.245552 0.371235 0.034839 0.333872 0.008230 -0.268178 -0.194060 -0.133635 0.224538 -0.090842 -0.203584 0.254390 -0.216269 -0.174579 -0.088736 -0.099820 -0.145521 0.121239 0.103515 0.149742 0.100396 0.075009 0.103326 0.092771 0.099499 0.095422 0.122147 0.130775 0.116948 0.128656 0.129536 0.124357 0.134349 0.126224 0.130094 0.126854
qa: -0.0605 0.0006 -0.0053 0.0087 -0.2594 -0.3740 -0.2972 -0.0018 0.0734 -0.0760 -0.1673 -0.1749 -0.2435 -0.2456 0.3712 0.0348 0.3339 0.0082 -0.2682 -0.1941 -0.1336 0.2245 -0.0908 -0.2036 0.2544 -0.2163 -0.1746 -0.0887 -0.0998 -0.1455 0.1212 0.1035 0.1497 0.1004 0.0750 0.1033 0.0928 0.0995 0.0954 0.1221 0.1308 0.1169 0.1287 0.1295 0.1244 0.1343 0.1262 0.1301 0.1269
va: 1.2024 1.2348 1.2373 1.2412 2.1296 2.1333 2.1165 3.1179 3.8889 3.7024 3.9313 4.1122 3.9030 3.9076 4.1859 4.3547 3.8332 3.6533 4.0273 3.9785 3.9873 3.8537 3.9542 4.0362 3.7880 4.0474 3.9586 3.9305 3.9478 3.9660 1.0456 1.0280 1.0026 1.0084 1.0086 1.0053 1.0018 1.0211 1.0035 1.0179 1.0161 1.0203 0.9995 1.0117 1.0140 1.0033 0.9987 0.9996 1.0003
dispcorr: -0.029211241 hartree
energy: -11427.144099283169
dipole: -145.01757 144.86051 -0.15706 119.17624 -118.62901 0.54722 27.79128 -26.61101 1.18027
magnitude: 1.31040 au
magnitude: 3.33078 debye
