program: Orca
programVersion: 5.0.2
elementType: Br Br Br Br O O O N C C C C C C C C C C C C C C C C C C C C C C H H H H H H H H H H H H H H H H H H H
charge: 0
multiplicity: 1
keywords: wb97x-d3
keywords: def2-TZVPP
keywords: def2/J RIJCOSX
keywords: DEFGRID2
keywords: scfconv7
keywords: smallprint printgap noloewdin
keywords: NOSOSCF
formula: C22H19Br4NO3
InChI: InChI=1/C22H19Br4NO3/c1-21(2)17(19(23)22(24,25)26)18(21)20(28)30-16(12-27)13-7-6-10-15(11-13)29-14-8-4-3-5-9-14/h3-11,16-19H,1-2H3
49 atoms
Br 3.472305 -1.674184 -1.396728
Br 3.160681 0.949329 0.838705
Br 1.370443 -0.880756 2.664563
Br 4.271192 -1.780695 1.938819
O  -2.557929 -1.101684 0.855273
O  -1.509716 0.633216 -0.093644
O  -5.542714 2.75461 -2.321444
N  -5.18238 -1.553546 2.808628
C  -0.004416 -1.805136 -1.47878
C  0.872551 -1.047634 -0.531493
C  -0.473695 -1.525288 -0.061526
C  2.135593 -1.627478 0.034382
C  0.268909 -3.256474 -1.797896
C  -0.589358 -1.047872 -2.646495
C  -1.527779 -0.526219 0.212821
C  2.704083 -0.877662 1.251263
C  -3.700424 -0.281416 1.073531
C  -4.462461 -0.03161 -0.205722
C  -4.520061 -1.00645 2.046611
C  -4.644508 1.271065 -0.64018
C  -4.944182 -1.101646 -0.948474
C  -5.304648 1.508694 -1.83958
C  -5.613695 -0.851927 -2.135008
C  -5.790072 0.445037 -2.588741
C  -4.704191 3.796715 -2.036997
C  -3.320759 3.67232 -2.075614
C  -5.295679 5.020889 -1.763628
C  -2.534894 4.787113 -1.827534
C  -4.496818 6.129567 -1.530923
C  -3.114862 6.017764 -1.556269
H  0.925061 0.01736 -0.734325
H  -0.506762 -2.397258 0.582124
H  1.990838 -2.666026 0.342839
H  0.66346 -3.819864 -0.952269
H  -0.656091 -3.747205 -2.103949
H  0.981054 -3.346207 -2.618192
H  -1.540811 -1.485322 -2.95371
H  -0.759324 0.003849 -2.42889
H  0.093575 -1.104146 -3.49519
H  -3.407628 0.673157 1.52319
H  -4.256507 2.093535 -0.053321
H  -4.806851 -2.118431 -0.603371
H  -5.999059 -1.676172 -2.719856
H  -6.305488 0.641835 -3.519444
H  -2.85496 2.718499 -2.287962
H  -6.374661 5.098751 -1.741206
H  -1.457926 4.68782 -1.851372
H  -4.96103 7.083978 -1.320908
H  -2.493926 6.882709 -1.367111
nucrepener: 5562.77961951 hartree
twoeener: 9966.02221387 hartree
xcener: -389.812165899398 hartree
chargesum: 0.0000000
charge: -0.060693 0.000786 -0.006439 0.009688 -0.252224 -0.366707 -0.294754 0.001165 0.071578 -0.071158 -0.159910 -0.177372 -0.248888 -0.234437 0.351711 0.033222 0.312724 0.033652 -0.255372 -0.157065 -0.218764 0.255021 -0.084127 -0.203382 0.264148 -0.180444 -0.217349 -0.110590 -0.087944 -0.144590 0.121324 0.103176 0.150286 0.076720 0.103446 0.101354 0.092102 0.087087 0.098414 0.118110 0.119831 0.123952 0.129541 0.129430 0.136014 0.125850 0.128714 0.126700 0.126463
qa: -0.0607 0.0008 -0.0064 0.0097 -0.2522 -0.3667 -0.2948 0.0012 0.0716 -0.0712 -0.1599 -0.1774 -0.2489 -0.2344 0.3517 0.0332 0.3127 0.0337 -0.2554 -0.1571 -0.2188 0.2550 -0.0841 -0.2034 0.2641 -0.1804 -0.2173 -0.1106 -0.0879 -0.1446 0.1213 0.1032 0.1503 0.0767 0.1034 0.1014 0.0921 0.0871 0.0984 0.1181 0.1198 0.1240 0.1295 0.1294 0.1360 0.1258 0.1287 0.1267 0.1265
va: 1.2027 1.2344 1.2341 1.2412 2.1350 2.1393 2.1244 3.1188 3.8955 3.7034 3.9077 4.1114 3.9011 3.9044 4.2202 4.3581 3.8476 3.6191 4.0184 3.9378 4.0338 3.8637 3.9299 4.0378 3.7818 3.9555 4.0451 3.9502 3.9286 3.9631 1.0439 1.0275 1.0025 1.0081 1.0047 1.0081 1.0032 1.0213 1.0052 1.0188 1.0158 1.0176 0.9988 1.0120 0.9997 1.0143 0.9996 0.9987 1.0002
dispcorr: -0.030115908 hartree
energy: -11427.143784112326
dipole: -153.20244 153.55115 0.34871 37.49868 -37.47331 0.02537 -62.49112 61.23151 -1.25961
magnitude: 1.30723 au
magnitude: 3.32272 debye
