program: Orca
programVersion: 5.0.2
elementType: Br Br Br Br O O O N C C C C C C C C C C C C C C C C C C C C C C H H H H H H H H H H H H H H H H H H H
charge: 0
multiplicity: 1
keywords: wb97x-d3
keywords: def2-TZVPP
keywords: def2/J RIJCOSX
keywords: DEFGRID2
keywords: scfconv7
keywords: smallprint printgap noloewdin
keywords: NOSOSCF
formula: C22H19Br4NO3
InChI: InChI=1/C22H19Br4NO3/c1-21(2)17(19(23)22(24,25)26)18(21)20(28)30-16(12-27)13-7-6-10-15(11-13)29-14-8-4-3-5-9-14/h3-11,16-19H,1-2H3
49 atoms
Br 3.648882 -2.866806 -0.51786
Br 1.772136 -0.477809 -2.144568
Br 0.802441 0.618441 0.634263
Br 3.863107 0.530886 -0.024781
O  -1.841775 -2.371465 0.037426
O  -2.119232 -1.727716 2.162023
O  -3.66305 2.800998 1.042516
N  -3.938273 -3.122294 -2.400091
C  0.70913 -3.801765 1.138593
C  0.973995 -2.573168 0.327549
C  0.012571 -2.500989 1.487733
C  2.262794 -1.808276 0.373283
C  1.716493 -4.283908 2.157035
C  -0.03161 -4.933979 0.469924
C  -1.416243 -2.168067 1.296939
C  2.187721 -0.406777 -0.258689
C  -3.101051 -1.800805 -0.307875
C  -2.931962 -0.329675 -0.597296
C  -3.561716 -2.545973 -1.48086
C  -3.416488 0.601041 0.306149
C  -2.218827 0.081299 -1.718069
C  -3.190028 1.956023 0.09074
C  -1.993617 1.430768 -1.917911
C  -2.469989 2.37573 -1.02038
C  -3.908321 4.112245 0.739376
C  -3.306353 5.083528 1.523151
C  -4.781226 4.465236 -0.281594
C  -3.586737 6.421352 1.28651
C  -5.045031 5.805575 -0.514157
C  -4.451596 6.787711 0.266909
H  0.513438 -2.591267 -0.654049
H  0.383981 -2.042466 2.397466
H  2.605391 -1.67216 1.402337
H  2.46184 -4.927394 1.689768
H  2.245902 -3.471946 2.6554
H  1.212954 -4.862672 2.932488
H  0.683252 -5.601738 -0.012774
H  -0.587037 -5.518504 1.204956
H  -0.731729 -4.59949 -0.291788
H  -3.828917 -1.950786 0.495171
H  -3.954141 0.286961 1.191533
H  -1.837754 -0.643021 -2.426317
H  -1.427737 1.759127 -2.779045
H  -2.274474 3.426425 -1.188647
H  -2.63258 4.788153 2.316546
H  -5.254875 3.700401 -0.883993
H  -3.121062 7.179412 1.902149
H  -5.726822 6.082273 -1.307288
H  -4.666644 7.831655 0.083804
nucrepener: 5808.05733473 hartree
xcener: -389.814251698504 hartree
chargesum: 0.0000000
charge: -0.059176 -0.012532 -0.007451 0.006154 -0.264976 -0.342786 -0.292006 0.000406 0.079898 -0.071383 -0.132894 -0.184543 -0.251999 -0.245759 0.332456 0.065012 0.301892 0.033483 -0.270087 -0.159883 -0.205611 0.210849 -0.108047 -0.147162 0.220523 -0.187453 -0.157674 -0.102591 -0.116402 -0.131782 0.111827 0.104929 0.149008 0.101296 0.075209 0.105085 0.095438 0.095227 0.094877 0.123986 0.118172 0.118950 0.127310 0.133287 0.126740 0.135697 0.127796 0.129074 0.127614
qa: -0.0592 -0.0125 -0.0075 0.0062 -0.2650 -0.3428 -0.2920 0.0004 0.0799 -0.0714 -0.1329 -0.1845 -0.2520 -0.2458 0.3325 0.0650 0.3019 0.0335 -0.2701 -0.1599 -0.2056 0.2108 -0.1080 -0.1472 0.2205 -0.1875 -0.1577 -0.1026 -0.1164 -0.1318 0.1118 0.1049 0.1490 0.1013 0.0752 0.1051 0.0954 0.0952 0.0949 0.1240 0.1182 0.1190 0.1273 0.1333 0.1267 0.1357 0.1278 0.1291 0.1276
va: 1.2042 1.2268 1.2352 1.2408 2.1006 2.1603 2.1099 3.1129 3.8706 3.6623 3.8981 4.1202 3.9125 3.9089 4.2466 4.3090 3.8514 3.6136 4.0175 4.0402 3.9968 3.8893 3.9415 3.9232 3.8197 4.0361 3.9635 3.9380 3.9420 3.9522 1.0459 1.0240 1.0012 1.0076 1.0079 1.0047 1.0040 1.0019 1.0150 1.0169 1.0332 1.0185 1.0043 1.0053 1.0125 1.0022 0.9989 0.9996 0.9998
dispcorr: -0.033245501 hartree
energy: -11427.144590047526
dipole: -115.12056 115.65030 0.52974 14.82604 -14.04512 0.78092 24.48772 -23.83572 0.65201
magnitude: 1.14698 au
magnitude: 2.91539 debye
