program: Orca
programVersion: 5.0.2
elementType: Br Br Br Br O O O N C C C C C C C C C C C C C C C C C C C C C C H H H H H H H H H H H H H H H H H H H
charge: 0
multiplicity: 1
keywords: wb97x-d3
keywords: def2-TZVPP
keywords: def2/J RIJCOSX
keywords: DEFGRID2
keywords: scfconv7
keywords: smallprint printgap noloewdin
keywords: NOSOSCF
formula: C22H19Br4NO3
InChI: InChI=1/C22H19Br4NO3/c1-21(2)17(19(23)22(24,25)26)18(21)20(28)30-16(12-27)13-7-6-10-15(11-13)29-14-8-4-3-5-9-14/h3-11,16-19H,1-2H3
49 atoms
Br 3.057808 0.860852 -0.753086
Br 0.745603 1.108777 1.834475
Br 1.053148 -1.979491 2.317787
Br 3.566068 -0.134888 2.468294
O  -1.817391 -1.766132 -0.72155
O  -1.316629 -3.934309 -0.531267
O  -3.908993 2.722062 -1.503885
N  -4.229484 -3.180108 -2.64331
C  0.957593 -1.593713 -2.118177
C  0.914457 -0.972545 -0.757581
C  0.44098 -2.394106 -0.936525
C  2.147569 -0.681474 0.044301
C  2.263371 -2.082626 -2.702445
C  0.026117 -1.039558 -3.169204
C  -0.964351 -2.804699 -0.715117
C  1.895872 -0.414775 1.536845
C  -3.19372 -2.038285 -0.528617
C  -3.88824 -0.723995 -0.270205
C  -3.755568 -2.691415 -1.718175
C  -3.56501 0.382146 -1.045222
C  -4.845325 -0.630401 0.726044
C  -4.184032 1.597198 -0.795441
C  -5.484083 0.583257 0.943676
C  -5.153458 1.698987 0.197609
C  -2.709052 2.82763 -2.156841
C  -2.724202 3.068442 -3.520609
C  -1.507558 2.735003 -1.465226
C  -1.522533 3.220743 -4.198299
C  -0.31426 2.879638 -2.153886
C  -0.316872 3.120737 -3.521574
H  0.131226 -0.230954 -0.64092
H  1.117574 -3.177677 -0.614481
H  2.861978 -1.506685 -0.012855
H  2.796416 -1.268649 -3.193942
H  2.93277 -2.518934 -1.961119
H  2.068381 -2.854001 -3.448397
H  -0.879854 -0.605005 -2.755376
H  0.532778 -0.248681 -3.723602
H  -0.263184 -1.81518 -3.879497
H  -3.338744 -2.714648 0.319717
H  -2.832698 0.299149 -1.837037
H  -5.094296 -1.49241 1.331492
H  -6.235272 0.664117 1.717543
H  -5.635314 2.650942 0.376742
H  -3.669763 3.138715 -4.041835
H  -1.50439 2.550556 -0.398329
H  -1.533621 3.411085 -5.263261
H  0.62092 2.802762 -1.615431
H  0.617576 3.23555 -4.054006
nucrepener: 5911.26385678 hartree
xcener: -389.813622906104 hartree
chargesum: -0.0000000
charge: -0.066786 -0.012781 -0.003292 0.012782 -0.261777 -0.327946 -0.295708 0.003802 0.135612 -0.060973 -0.187322 -0.171103 -0.249065 -0.245857 0.340509 0.051498 0.242343 0.054163 -0.236590 -0.168820 -0.162183 0.203122 -0.087934 -0.195037 0.244909 -0.188429 -0.187984 -0.084978 -0.096175 -0.164147 0.085394 0.105624 0.153641 0.098103 0.074805 0.107623 0.052163 0.093028 0.113763 0.117487 0.146284 0.113176 0.127897 0.129871 0.127483 0.132670 0.128924 0.129860 0.128346
qa: -0.0668 -0.0128 -0.0033 0.0128 -0.2618 -0.3279 -0.2957 0.0038 0.1356 -0.0610 -0.1873 -0.1711 -0.2491 -0.2459 0.3405 0.0515 0.2423 0.0542 -0.2366 -0.1688 -0.1622 0.2031 -0.0879 -0.1950 0.2449 -0.1884 -0.1880 -0.0850 -0.0962 -0.1641 0.0854 0.1056 0.1536 0.0981 0.0748 0.1076 0.0522 0.0930 0.1138 0.1175 0.1463 0.1132 0.1279 0.1299 0.1275 0.1327 0.1289 0.1299 0.1283
va: 1.2010 1.2264 1.2374 1.2447 2.1227 2.1760 2.1256 3.1145 3.8101 3.6608 3.9974 4.0873 3.9126 3.9440 4.2384 4.3351 3.9265 3.7281 3.9588 3.9394 4.0092 3.9061 3.9701 4.0337 3.8253 4.0368 3.9526 3.9151 3.8524 3.9609 1.0453 1.0244 1.0005 1.0080 1.0089 1.0044 1.0154 1.0064 1.0062 1.0242 0.9925 1.0106 0.9998 1.0120 1.0123 1.0015 0.9980 1.0095 1.0012
dispcorr: -0.035192746 hartree
energy: -11427.146495811963
dipole: -92.90563 93.71567 0.81004 -0.00596 0.99220 0.98625 -85.75491 86.07056 0.31565
magnitude: 1.31472 au
magnitude: 3.34175 debye
