program: Orca
programVersion: 5.0.2
elementType: Br Br Br Br O O O N C C C C C C C C C C C C C C C C C C C C C C H H H H H H H H H H H H H H H H H H H
charge: 0
multiplicity: 1
keywords: wb97x-d3
keywords: def2-TZVPP
keywords: def2/J RIJCOSX
keywords: DEFGRID2
keywords: scfconv7
keywords: smallprint printgap noloewdin
keywords: NOSOSCF
formula: C22H19Br4NO3
InChI: InChI=1/C22H19Br4NO3/c1-21(2)17(19(23)22(24,25)26)18(21)20(28)30-16(12-27)13-7-6-10-15(11-13)29-14-8-4-3-5-9-14/h3-11,16-19H,1-2H3
49 atoms
Br 3.411728 -3.130663 -0.289634
Br 1.710891 -1.029158 -2.408412
Br 1.141362 0.913711 -0.012168
Br 4.09604 0.21176 -0.780693
O  -1.925025 -1.690337 0.652409
O  -1.715054 -0.334923 2.419155
O  -3.051489 3.834386 -0.290235
N  -4.555015 -2.803993 -1.021391
C  0.582548 -3.132523 1.764799
C  0.900452 -2.210561 0.630751
C  0.126326 -1.688347 1.818257
C  2.273353 -1.673163 0.355272
C  1.639788 -3.507583 2.778401
C  -0.387625 -4.257831 1.496439
C  -1.250931 -1.166102 1.690577
C  2.304235 -0.504517 -0.646418
C  -3.147771 -1.047663 0.304333
C  -2.871037 0.181897 -0.524706
C  -3.923554 -2.041353 -0.439529
C  -3.140475 1.434906 0.00791
C  -2.286537 0.051323 -1.776572
C  -2.836654 2.570249 -0.734768
C  -1.974864 1.191214 -2.498955
C  -2.248964 2.447801 -1.988482
C  -3.866287 4.040772 0.792453
C  -3.298343 4.464603 1.982361
C  -5.239013 3.8706 0.679548
C  -4.117181 4.729437 3.070748
C  -6.046305 4.131959 1.775433
C  -5.489753 4.560681 2.972612
H  0.313075 -2.395379 -0.262342
H  0.686005 -1.08219 2.522042
H  2.742674 -1.313139 1.274326
H  2.214871 -4.368386 2.437878
H  2.343918 -2.702518 2.988879
H  1.166231 -3.77502 3.724025
H  0.163241 -5.138418 1.163268
H  -0.925712 -4.528682 2.406264
H  -1.121089 -4.020939 0.730454
H  -3.714032 -0.781918 1.202061
H  -3.567366 1.51808 0.998987
H  -2.076415 -0.927295 -2.188663
H  -1.515463 1.101622 -3.473776
H  -2.010836 3.33967 -2.552753
H  -2.225867 4.591099 2.049396
H  -5.669891 3.54433 -0.258526
H  -3.676414 5.064875 3.999977
H  -7.117291 4.004243 1.690581
H  -6.124792 4.766244 3.823593
nucrepener: 5817.65007166 hartree
xcener: -389.813264446313 hartree
chargesum: -0.0000000
charge: -0.059366 -0.011050 -0.005562 0.004673 -0.264575 -0.344162 -0.293043 0.000888 0.083441 -0.075599 -0.127203 -0.187914 -0.250498 -0.243740 0.325634 0.064115 0.301252 0.012064 -0.269865 -0.111510 -0.220423 0.225751 -0.081499 -0.189665 0.198444 -0.153563 -0.150256 -0.115375 -0.124370 -0.118926 0.112637 0.102605 0.147327 0.100456 0.076116 0.105223 0.094092 0.094581 0.095225 0.121008 0.119810 0.117532 0.124764 0.127748 0.124687 0.132794 0.127421 0.129492 0.128384
qa: -0.0594 -0.0111 -0.0056 0.0047 -0.2646 -0.3442 -0.2930 0.0009 0.0834 -0.0756 -0.1272 -0.1879 -0.2505 -0.2437 0.3256 0.0641 0.3013 0.0121 -0.2699 -0.1115 -0.2204 0.2258 -0.0815 -0.1897 0.1984 -0.1536 -0.1503 -0.1154 -0.1244 -0.1189 0.1126 0.1026 0.1473 0.1005 0.0761 0.1052 0.0941 0.0946 0.0952 0.1210 0.1198 0.1175 0.1248 0.1277 0.1247 0.1328 0.1274 0.1295 0.1284
va: 1.2026 1.2284 1.2362 1.2386 2.1026 2.1564 2.1152 3.1139 3.8621 3.6751 3.8885 4.1239 3.9134 3.9107 4.2516 4.3124 3.8566 3.6293 4.0149 3.8855 4.0041 3.8612 3.9298 4.0304 3.8490 4.0239 3.9871 3.9478 3.9469 3.9419 1.0429 1.0258 1.0020 1.0074 1.0076 1.0046 1.0040 1.0023 1.0155 1.0201 1.0274 1.0183 1.0018 1.0127 1.0112 1.0044 0.9997 0.9996 0.9997
dispcorr: -0.033257599 hartree
energy: -11427.144746372027
dipole: -121.83319 122.25044 0.41725 22.19054 -21.72739 0.46315 51.49294 -50.53497 0.95797
magnitude: 1.14294 au
magnitude: 2.90511 debye
