program: Orca
programVersion: 5.0.2
elementType: Br Br Br Br O O O N C C C C C C C C C C C C C C C C C C C C C C H H H H H H H H H H H H H H H H H H H
charge: 0
multiplicity: 1
keywords: wb97x-d3
keywords: def2-TZVPP
keywords: def2/J RIJCOSX
keywords: DEFGRID2
keywords: scfconv7
keywords: smallprint printgap noloewdin
keywords: NOSOSCF
formula: C22H19Br4NO3
InChI: InChI=1/C22H19Br4NO3/c1-21(2)17(19(23)22(24,25)26)18(21)20(28)30-16(12-27)13-7-6-10-15(11-13)29-14-8-4-3-5-9-14/h3-11,16-19H,1-2H3
49 atoms
Br 3.535469 0.634197 1.142206
Br 2.490986 -2.615061 1.731925
Br 1.157308 -2.654326 -1.114991
Br 4.211712 -2.075666 -0.851551
O  -2.479487 -0.439901 -0.940211
O  -1.946953 -0.812925 1.202233
O  -5.017338 3.769827 0.333019
N  -4.747446 -1.631503 -3.019421
C  0.205096 1.408407 0.455258
C  0.831057 0.06005 0.62819
C  -0.360226 0.205546 -0.279086
C  2.178944 -0.279185 0.063172
C  0.845114 2.459325 -0.422252
C  -0.520668 1.997627 1.639527
C  -1.643551 -0.408344 0.116852
C  2.495544 -1.782631 -0.006947
C  -3.791024 -0.906996 -0.697084
C  -4.687126 0.140872 -0.069012
C  -4.315352 -1.304211 -2.006932
C  -4.381619 1.490284 -0.186446
C  -5.834609 -0.271481 0.587654
C  -5.241261 2.430762 0.366759
C  -6.690462 0.679557 1.12306
C  -6.402581 2.026921 1.016894
C  -3.939722 4.275533 -0.341191
C  -3.908596 4.282804 -1.728961
C  -2.904329 4.830518 0.393942
C  -2.824269 4.850045 -2.379783
C  -1.829424 5.406243 -0.268232
C  -1.782983 5.412835 -1.654425
H  0.616026 -0.408457 1.583617
H  -0.179708 0.207466 -1.347997
H  2.291543 0.113739 -0.950462
H  1.580637 3.036525 0.13876
H  1.346248 2.046959 -1.298007
H  0.081875 3.149695 -0.784825
H  0.18095 2.576029 2.242571
H  -1.310475 2.67288 1.306522
H  -0.969002 1.245205 2.283863
H  -3.772843 -1.795576 -0.055963
H  -3.484543 1.804345 -0.702615
H  -6.064632 -1.325224 0.682588
H  -7.589642 0.366195 1.635936
H  -7.062488 2.772329 1.440119
H  -4.727567 3.854743 -2.292818
H  -2.952487 4.823108 1.475198
H  -2.798046 4.857754 -3.461217
H  -1.025249 5.848808 0.304735
H  -0.943995 5.862341 -2.168263
nucrepener: 5643.97879571 hartree
xcener: -389.814480217942 hartree
chargesum: -0.0000000
charge: -0.061042 0.003002 -0.005798 0.008539 -0.273502 -0.348787 -0.293562 0.002095 0.103008 -0.067872 -0.167520 -0.189703 -0.250211 -0.237698 0.326900 0.034742 0.294109 0.070922 -0.256007 -0.223203 -0.206085 0.296833 -0.067256 -0.219706 0.269454 -0.175169 -0.221995 -0.101886 -0.143954 -0.124463 0.122235 0.102551 0.151606 0.101133 0.077127 0.095336 0.098923 0.069059 0.107032 0.132377 0.123315 0.109196 0.127910 0.127591 0.136166 0.140783 0.134160 0.134610 0.134704
qa: -0.0610 0.0030 -0.0058 0.0085 -0.2735 -0.3488 -0.2936 0.0021 0.1030 -0.0679 -0.1675 -0.1897 -0.2502 -0.2377 0.3269 0.0347 0.2941 0.0709 -0.2560 -0.2232 -0.2061 0.2968 -0.0673 -0.2197 0.2695 -0.1752 -0.2220 -0.1019 -0.1440 -0.1245 0.1222 0.1026 0.1516 0.1011 0.0771 0.0953 0.0989 0.0691 0.1070 0.1324 0.1233 0.1092 0.1279 0.1276 0.1362 0.1408 0.1342 0.1346 0.1347
va: 1.2027 1.2371 1.2352 1.2413 2.0973 2.1556 2.1291 3.1248 3.8498 3.7206 3.9138 4.1252 3.9045 3.8851 4.2250 4.3551 3.8304 3.7347 4.0030 3.9640 4.0753 3.7904 3.9437 4.0448 3.7455 3.9864 3.9741 3.9255 3.8704 3.8835 1.0449 1.0300 1.0017 1.0084 1.0134 1.0156 1.0048 1.0180 1.0240 1.0181 1.0269 1.0119 0.9987 1.0138 1.0044 1.0054 0.9975 0.9987 0.9978
dispcorr: -0.032708053 hartree
energy: -11427.145900092984
dipole: -140.44715 140.66250 0.21535 100.53379 -99.10386 1.42993 -8.52244 8.98265 0.46021
magnitude: 1.51752 au
magnitude: 3.85723 debye
