program: Orca
programVersion: 5.0.2
elementType: Br Br Br Br O O O N C C C C C C C C C C C C C C C C C C C C C C H H H H H H H H H H H H H H H H H H H
charge: 0
multiplicity: 1
keywords: wb97x-d3
keywords: def2-TZVPP
keywords: def2/J RIJCOSX
keywords: DEFGRID2
keywords: scfconv7
keywords: smallprint printgap noloewdin
keywords: NOSOSCF
formula: C22H19Br4NO3
InChI: InChI=1/C22H19Br4NO3/c1-21(2)17(19(23)22(24,25)26)18(21)20(28)30-16(12-27)13-7-6-10-15(11-13)29-14-8-4-3-5-9-14/h3-11,16-19H,1-2H3
49 atoms
Br 3.566105 -2.07261 -0.596608
Br 1.198669 0.08222 -1.861111
Br 0.317041 0.7971 1.06616
Br 3.278802 1.282058 0.167278
O  -1.870178 -2.57585 0.498914
O  -1.994022 -1.822858 2.602883
O  -3.959506 2.562908 1.048065
N  -4.161626 -3.803449 -1.528032
C  0.958867 -3.578123 1.228727
C  0.968469 -2.275022 0.49624
C  0.125183 -2.421419 1.742496
C  2.123916 -1.319332 0.491527
C  2.12038 -3.968911 2.113845
C  0.326878 -4.765614 0.543277
C  -1.342801 -2.250429 1.691678
C  1.767143 0.089981 -0.01765
C  -3.204761 -2.142429 0.24648
C  -3.188988 -0.717468 -0.248501
C  -3.735829 -3.07296 -0.750891
C  -3.585814 0.302744 0.601091
C  -2.692243 -0.425927 -1.513541
C  -3.507592 1.624956 0.176569
C  -2.618284 0.892712 -1.923825
C  -3.025856 1.923878 -1.091361
C  -3.53483 3.860238 0.953926
C  -4.501206 4.853404 0.93681
C  -2.184755 4.186661 0.935425
C  -4.111808 6.184307 0.907096
C  -1.809266 5.519801 0.895296
C  -2.76773 6.5230 0.881026
H  0.416936 -2.295459 -0.437549
H  0.520623 -1.968014 2.644586
H  2.538905 -1.198371 1.495328
H  2.90383 -4.453255 1.531135
H  2.570168 -3.123664 2.634794
H  1.78499 -4.673652 2.875906
H  -0.469271 -4.494034 -0.144354
H  1.086507 -5.300917 -0.027892
H  -0.084861 -5.459194 1.278016
H  -3.817139 -2.227855 1.148817
H  -3.95166 0.085372 1.596536
H  -2.376149 -1.2192 -2.178808
H  -2.243457 1.128619 -2.9105
H  -2.970499 2.947687 -1.435915
H  -5.548064 4.580553 0.95467
H  -1.430644 3.410434 0.95138
H  -4.866915 6.959056 0.898153
H  -0.757508 5.77297 0.881232
H  -2.467538 7.561611 0.853642
nucrepener: 5927.01775253 hartree
xcener: -389.816167926060 hartree
chargesum: 0.0000000
charge: -0.057335 -0.005482 -0.016706 0.006646 -0.262926 -0.342625 -0.290896 -0.000022 0.088083 -0.091501 -0.116086 -0.183486 -0.248862 -0.241212 0.313455 0.071532 0.301240 0.052371 -0.268741 -0.186509 -0.203537 0.220128 -0.121520 -0.138405 0.217447 -0.173268 -0.132236 -0.112552 -0.148611 -0.119282 0.111898 0.104233 0.148918 0.101072 0.075099 0.104055 0.094910 0.093616 0.094697 0.125604 0.119724 0.120113 0.130523 0.133425 0.126590 0.123166 0.126896 0.128767 0.127593
qa: -0.0573 -0.0055 -0.0167 0.0066 -0.2629 -0.3426 -0.2909 -0.0000 0.0881 -0.0915 -0.1161 -0.1835 -0.2489 -0.2412 0.3135 0.0715 0.3012 0.0524 -0.2687 -0.1865 -0.2035 0.2201 -0.1215 -0.1384 0.2174 -0.1733 -0.1322 -0.1126 -0.1486 -0.1193 0.1119 0.1042 0.1489 0.1011 0.0751 0.1041 0.0949 0.0936 0.0947 0.1256 0.1197 0.1201 0.1305 0.1334 0.1266 0.1232 0.1269 0.1288 0.1276
va: 1.2055 1.2321 1.2293 1.2410 2.0947 2.1570 2.1158 3.1113 3.8663 3.6859 3.8723 4.1310 3.9124 3.9086 4.2614 4.2934 3.8416 3.6007 4.0200 4.0191 3.9903 3.8884 3.9425 3.9244 3.7952 4.0214 3.9285 3.9449 3.9947 3.9360 1.0442 1.0245 1.0004 1.0076 1.0079 1.0050 1.0161 1.0036 1.0025 1.0182 1.0328 1.0184 1.0006 1.0037 1.0126 1.0057 0.9993 1.0000 0.9997
dispcorr: -0.034559527 hartree
energy: -11427.145609028839
dipole: -95.28717 96.18919 0.90202 -3.75899 4.57717 0.81818 25.32230 -24.89904 0.42326
magnitude: 1.28927 au
magnitude: 3.27706 debye
