program: Orca
programVersion: 5.0.2
elementType: Br Br Br Br O O O N C C C C C C C C C C C C C C C C C C C C C C H H H H H H H H H H H H H H H H H H H
charge: 0
multiplicity: 1
keywords: wb97x-d3
keywords: def2-TZVPP
keywords: def2/J RIJCOSX
keywords: DEFGRID2
keywords: scfconv7
keywords: smallprint printgap noloewdin
keywords: NOSOSCF
formula: C22H19Br4NO3
InChI: InChI=1/C22H19Br4NO3/c1-21(2)17(19(23)22(24,25)26)18(21)20(28)30-16(12-27)13-7-6-10-15(11-13)29-14-8-4-3-5-9-14/h3-11,16-19H,1-2H3
49 atoms
Br 2.901609 0.401928 -1.511565
Br 0.584166 1.615906 0.730382
Br 0.903402 -1.006512 2.438132
Br 3.397698 0.788966 1.869582
O  -1.891375 -2.206923 -0.36643
O  -1.237184 -4.023781 0.75545
O  -3.469193 2.484739 -0.250833
N  -4.303434 -4.448324 -1.141294
C  0.876341 -2.446686 -1.770402
C  0.81499 -1.340592 -0.765526
C  0.409411 -2.73566 -0.356662
C  2.032752 -0.712716 -0.154071
C  2.197408 -3.074446 -2.152435
C  -0.096967 -2.391949 -2.923252
C  -0.96312 -3.080731 0.070845
C  1.748545 0.128286 1.102693
C  -3.220494 -2.40263 0.078131
C  -4.001865 -1.130735 -0.1842
C  -3.813888 -3.558007 -0.606123
C  -3.354405 0.094519 -0.099783
C  -5.365974 -1.177388 -0.444938
C  -4.069336 1.263241 -0.324145
C  -6.073014 -0.000204 -0.628601
C  -5.429611 1.225307 -0.585778
C  -2.34738 2.746504 -0.97936
C  -1.991678 2.036457 -2.120075
C  -1.56683 3.81327 -0.546741
C  -0.841129 2.391034 -2.809912
C  -0.429474 4.163938 -1.258286
C  -0.05424 3.45015 -2.387369
H  0.002414 -0.64251 -0.937375
H  1.130782 -3.292463 0.230861
H  2.767826 -1.471412 0.126039
H  2.677979 -2.508313 -2.950297
H  2.900779 -3.140133 -1.322449
H  2.033354 -4.090402 -2.513894
H  -0.345327 -3.396061 -3.26994
H  -1.02574 -1.883528 -2.676798
H  0.359574 -1.856131 -3.756689
H  -3.225277 -2.624419 1.151581
H  -2.298355 0.153752 0.130147
H  -5.882841 -2.125285 -0.515749
H  -7.134873 -0.040784 -0.829317
H  -5.970262 2.147462 -0.751542
H  -2.599981 1.216742 -2.478204
H  -1.861687 4.365497 0.336215
H  -0.564406 1.82957 -3.692412
H  0.173282 4.994636 -0.915938
H  0.843422 3.714703 -2.928309
nucrepener: 6042.57218578 hartree
xcener: -389.819626063067 hartree
chargesum: 0.0000000
charge: -0.064555 -0.009655 -0.013602 0.003876 -0.273908 -0.325820 -0.293214 -0.000539 0.114050 -0.058700 -0.152893 -0.163101 -0.247099 -0.252406 0.334043 0.070646 0.311080 0.019319 -0.247730 -0.171483 -0.165771 0.230793 -0.098949 -0.181663 0.282573 -0.168224 -0.260122 -0.127367 -0.096987 -0.122942 0.068978 0.104328 0.149655 0.098827 0.075012 0.106896 0.105198 0.080633 0.092287 0.131597 0.085850 0.128118 0.131536 0.129675 0.133091 0.130108 0.125080 0.129935 0.123547
qa: -0.0646 -0.0097 -0.0136 0.0039 -0.2739 -0.3258 -0.2932 -0.0005 0.1140 -0.0587 -0.1529 -0.1631 -0.2471 -0.2524 0.3340 0.0706 0.3111 0.0193 -0.2477 -0.1715 -0.1658 0.2308 -0.0989 -0.1817 0.2826 -0.1682 -0.2601 -0.1274 -0.0970 -0.1229 0.0690 0.1043 0.1497 0.0988 0.0750 0.1069 0.1052 0.0806 0.0923 0.1316 0.0859 0.1281 0.1315 0.1297 0.1331 0.1301 0.1251 0.1299 0.1235
va: 1.2000 1.2527 1.2332 1.2403 2.0930 2.1737 2.1195 3.1117 3.8487 3.6758 3.9573 4.0826 3.9142 3.9134 4.2158 4.3097 3.8162 3.7783 3.9732 3.9653 3.9895 3.8348 3.9650 4.0447 3.7280 3.8629 3.9241 3.9287 3.8866 3.9139 1.0416 1.0256 1.0028 1.0077 1.0091 1.0043 1.0036 1.0185 1.0044 1.0085 1.0424 1.0205 1.0001 1.0106 1.0048 1.0163 1.0020 0.9993 1.0015
dispcorr: -0.036217983 hartree
energy: -11427.147520535827
dipole: -89.00035 89.50474 0.50439 -25.48971 26.58882 1.09910 -58.55475 58.08525 -0.46951
magnitude: 1.29726 au
magnitude: 3.29737 debye
