program: Orca
programVersion: 5.0.2
elementType: O O O O N C C C C C C C C C C C C C C C C C C C H H H H H H H H H H H H H H H H H H H H H H H H H
charge: 0
multiplicity: 1
keywords: wb97x-d3
keywords: def2-TZVPP
keywords: def2/J RIJCOSX
keywords: DEFGRID2
keywords: scfconv7
keywords: smallprint printgap noloewdin
keywords: NOSOSCF
formula: C19H25NO4
InChI: InChI=1/C19H25NO4/c1-11(2)9-14-15(19(14,3)4)18(23)24-10-20-16(21)12-7-5-6-8-13(12)17(20)22/h9,14-15H,5-8,10H2,1-4H3
49 atoms
O  1.120365 -1.718384 -1.010922
O  1.822769 -1.532417 1.111358
O  -1.640783 -1.462785 -2.792743
O  -1.158165 -1.108433 1.712591
N  -1.172741 -1.629229 -0.540632
C  4.167516 0.178314 -0.016343
C  3.018552 1.115565 0.102438
C  2.84228 -0.229737 -0.625604
C  5.230558 0.519132 -1.035075
C  4.728848 -0.51497 1.200445
C  2.338996 1.398199 1.388475
C  1.921258 -1.212423 -0.047836
C  1.08569 1.851994 1.47717
C  -0.020624 -2.471626 -0.634658
C  0.458684 2.174858 2.79715
C  0.23083 2.075076 0.261235
C  -2.835587 -0.149129 -1.148835
C  -2.683451 -0.038989 0.171268
C  -3.830201 0.594007 -1.959603
C  -3.462133 0.868532 1.047374
C  -4.86415 1.233979 -1.031542
C  -4.212083 1.886104 0.18635
C  -1.847958 -1.131244 -1.652023
C  -1.598598 -0.954676 0.600702
H  3.014425 1.944581 -0.601061
H  2.784729 -0.159158 -1.705081
H  5.984605 1.175695 -0.597558
H  5.737211 -0.382012 -1.385534
H  4.812487 1.02703 -1.90496
H  3.997962 -0.713411 1.978607
H  5.184772 -1.466529 0.922114
H  5.511983 0.106391 1.638875
H  2.909755 1.253703 2.300516
H  0.119262 -3.000207 0.305596
H  -0.178113 -3.203033 -1.42235
H  -0.425193 1.554611 2.969658
H  1.146852 2.024143 3.628828
H  0.115478 3.212395 2.82389
H  0.56639 2.94813 -0.30465
H  0.25733 1.228353 -0.427877
H  -0.810221 2.253253 0.531697
H  -3.316044 1.355767 -2.553932
H  -4.310126 -0.075582 -2.677029
H  -4.160247 0.279514 1.650482
H  -2.798633 1.369993 1.756613
H  -5.444183 1.972483 -1.58584
H  -5.569068 0.467576 -0.697394
H  -4.968307 2.387517 0.791116
H  -3.513019 2.657998 -0.148065
elementType: O N C H
totalener: -1094.86595429 hartree
nucrepener: 2218.06656010 hartree
electener: -3312.93251438 hartree
oneelecener: -5898.80989353 hartree
twoeener: 2585.87737914 hartree
cpcmener: -0.04432815 hartree
kineticenergy: 1090.03895472 hartree
xcener: -105.975040509976 hartree
chargesum: -0.0000000
charge: -0.291912 -0.471509 -0.435017 -0.428093 -0.084214 0.131121 -0.017845 -0.101617 -0.264749 -0.297165 -0.275940 0.399394 -0.019250 0.070907 -0.215746 -0.272481 -0.045836 -0.084284 -0.070185 -0.088380 -0.134410 -0.134553 0.341739 0.301339 0.115982 0.093916 0.095514 0.096779 0.088556 0.091562 0.102694 0.100562 0.126267 0.132087 0.135845 0.081067 0.092201 0.104068 0.124932 0.084807 0.093692 0.102118 0.094817 0.112779 0.097334 0.080911 0.078402 0.083496 0.078301
qa: -0.2919 -0.4715 -0.4350 -0.4281 -0.0842 0.1311 -0.0178 -0.1016 -0.2647 -0.2972 -0.2759 0.3994 -0.0193 0.0709 -0.2157 -0.2725 -0.0458 -0.0843 -0.0702 -0.0884 -0.1344 -0.1346 0.3417 0.3013 0.1160 0.0939 0.0955 0.0968 0.0886 0.0916 0.1027 0.1006 0.1263 0.1321 0.1358 0.0811 0.0922 0.1041 0.1249 0.0848 0.0937 0.1021 0.0948 0.1128 0.0973 0.0809 0.0784 0.0835 0.0783
va: 2.0974 2.0166 2.0744 2.0675 3.1056 3.7706 3.8013 3.8370 3.8963 3.8901 3.8143 4.0905 3.6806 3.9155 3.9052 3.9613 3.6629 3.6311 3.9131 3.9156 3.9154 3.9058 4.1740 4.1575 1.0036 1.0334 1.0023 1.0022 1.0042 1.0167 1.0000 0.9984 1.0002 1.0170 1.0043 1.0052 1.0096 0.9936 0.9993 1.0002 1.0057 1.0065 1.0138 1.0064 1.0100 1.0096 1.0064 1.0099 1.0074
dispcorr: -0.028492296 hartree
energy: -1094.894446582167
dipole: 6.19120 -7.41854 -1.22734 19.52638 -17.83727 1.68911 5.29245 -6.15391 -0.86146
magnitude: 2.25867 au
magnitude: 5.74107 debye
