program: Orca
programVersion: 5.0.2
elementType: O O O O N C C C C C C C C C C C C C C C C C C C H H H H H H H H H H H H H H H H H H H H H H H H H
charge: 0
multiplicity: 1
keywords: wb97x-d3
keywords: def2-TZVPP
keywords: def2/J RIJCOSX
keywords: DEFGRID2
keywords: scfconv7
keywords: smallprint printgap noloewdin
keywords: NOSOSCF
formula: C19H25NO4
InChI: InChI=1/C19H25NO4/c1-11(2)9-14-15(19(14,3)4)18(23)24-10-20-16(21)12-7-5-6-8-13(12)17(20)22/h9,14-15H,5-8,10H2,1-4H3
49 atoms
O  1.172889 -1.159992 -0.496879
O  2.701493 -2.124626 -1.798368
O  -1.447785 -0.167866 -2.490418
O  -1.127676 -2.050272 1.62354
N  -1.088878 -1.444831 -0.602302
C  3.634189 -0.228846 1.119207
C  3.037539 0.917866 0.381645
C  3.38266 -0.36354 -0.378132
C  5.090601 -0.129593 1.506061
C  2.82204 -1.018687 2.116478
C  1.655225 1.404955 0.607057
C  2.40822 -1.298611 -0.959531
C  1.001786 2.183024 -0.25867
C  0.152363 -2.033641 -0.970786
C  -0.37462 2.699867 0.022352
C  1.597406 2.556189 -1.586749
C  -2.785133 0.113696 -0.493813
C  -2.685441 -0.433404 0.719057
C  -3.759722 1.161956 -0.879372
C  -3.538295 -0.090549 1.882217
C  -4.351975 1.786889 0.384033
C  -4.743992 0.724954 1.41036
C  -1.731849 -0.466754 -1.357973
C  -1.570049 -1.407721 0.704147
H  3.742055 1.708158 0.131718
H  4.278491 -0.313139 -0.985972
H  5.66861 0.433886 0.77291
H  5.194926 0.372668 2.469763
H  5.539549 -1.120194 1.597973
H  3.18354 -2.047251 2.171445
H  2.940356 -0.579473 3.108831
H  1.756291 -1.053671 1.905492
H  1.169628 1.132093 1.539086
H  0.250254 -3.016122 -0.51045
H  0.187229 -2.144043 -2.05319
H  -0.379291 3.792431 0.070829
H  -1.062317 2.431609 -0.783625
H  -0.777735 2.317716 0.960272
H  2.618935 2.928518 -1.493433
H  1.637749 1.690708 -2.253648
H  1.011147 3.324574 -2.089802
H  -3.278953 1.918428 -1.504026
H  -4.546149 0.714838 -1.495922
H  -3.857894 -0.996074 2.402567
H  -2.942606 0.477925 2.603548
H  -3.616562 2.466645 0.825048
H  -5.220516 2.391389 0.120616
H  -5.481313 0.050832 0.965941
H  -5.225289 1.192879 2.269707
elementType: O N C H
totalener: -1094.86370690 hartree
nucrepener: 2229.73366120 hartree
electener: -3324.59736810 hartree
oneelecener: -5921.25378986 hartree
twoeener: 2596.65642176 hartree
cpcmener: -0.03847811 hartree
kineticenergy: 1090.05423341 hartree
xcener: -105.977091675801 hartree
chargesum: -0.0000000
charge: -0.250292 -0.502202 -0.431096 -0.433879 -0.098383 0.121040 -0.034388 -0.137896 -0.268047 -0.275036 -0.230321 0.433770 -0.038283 0.068113 -0.233657 -0.275934 -0.063941 -0.045164 -0.086936 -0.073092 -0.138448 -0.129329 0.303928 0.316240 0.119443 0.094414 0.087724 0.094401 0.096193 0.104768 0.101710 0.073133 0.128720 0.145835 0.125938 0.116562 0.087831 0.087698 0.102587 0.097930 0.100684 0.101935 0.112187 0.098107 0.102662 0.080029 0.083422 0.078611 0.080712
qa: -0.2503 -0.5022 -0.4311 -0.4339 -0.0984 0.1210 -0.0344 -0.1379 -0.2680 -0.2750 -0.2303 0.4338 -0.0383 0.0681 -0.2337 -0.2759 -0.0639 -0.0452 -0.0869 -0.0731 -0.1384 -0.1293 0.3039 0.3162 0.1194 0.0944 0.0877 0.0944 0.0962 0.1048 0.1017 0.0731 0.1287 0.1458 0.1259 0.1166 0.0878 0.0877 0.1026 0.0979 0.1007 0.1019 0.1122 0.0981 0.1027 0.0800 0.0834 0.0786 0.0807
va: 2.1029 1.9951 2.0662 2.0682 3.1416 3.7814 3.7862 3.8800 3.9059 3.9072 3.7587 4.0863 3.6919 3.9034 3.9321 3.9530 3.6345 3.6657 3.9023 3.9147 3.9108 3.9077 4.1569 4.1648 1.0019 1.0293 1.0057 1.0016 1.0018 1.0008 0.9999 1.0127 0.9975 0.9962 1.0141 0.9951 0.9913 1.0052 0.9998 0.9987 1.0040 1.0079 1.0044 1.0133 1.0066 1.0081 1.0113 1.0065 1.0099
dispcorr: -0.029015370 hartree
energy: -1094.892722265309
dipole: 2.68585 -4.42160 -1.73575 18.07869 -16.28198 1.79671 10.06965 -8.67589 1.39375
magnitude: 2.86069 au
magnitude: 7.27130 debye
