program: Orca
programVersion: 5.0.2
elementType: O O O O N C C C C C C C C C C C C C C C C C C C H H H H H H H H H H H H H H H H H H H H H H H H H
charge: 0
multiplicity: 1
keywords: wb97x-d3
keywords: def2-TZVPP
keywords: def2/J RIJCOSX
keywords: DEFGRID2
keywords: scfconv7
keywords: smallprint printgap noloewdin
keywords: NOSOSCF
formula: C19H25NO4
InChI: InChI=1/C19H25NO4/c1-11(2)9-14-15(19(14,3)4)18(23)24-10-20-16(21)12-7-5-6-8-13(12)17(20)22/h9,14-15H,5-8,10H2,1-4H3
49 atoms
O  1.235284 -1.81678 -1.102126
O  1.322652 -1.342462 1.079558
O  -1.121911 -0.47009 -2.652967
O  -1.568581 -2.164865 1.543983
N  -1.07357 -1.59414 -0.642633
C  4.074094 -0.045116 0.565039
C  3.114402 0.962528 0.035632
C  3.011377 -0.509863 -0.40711
C  5.468404 -0.025217 -0.018618
C  4.066445 -0.451166 2.018493
C  2.054917 1.588245 0.862712
C  1.807418 -1.254434 -0.023093
C  0.982289 2.206639 0.359404
C  -0.000566 -2.493895 -0.931152
C  -0.02906 2.865488 1.245054
C  0.71135 2.308913 -1.111103
C  -2.526919 0.190371 -0.791032
C  -2.655429 -0.314342 0.436815
C  -3.287099 1.34844 -1.320554
C  -3.598824 0.178522 1.468797
C  -3.987346 2.069269 -0.167259
C  -4.63483 1.090297 0.811093
C  -1.512363 -0.609574 -1.519974
C  -1.724834 -1.459576 0.579649
H  3.496917 1.591061 -0.763319
H  3.34974 -0.705711 -1.417664
H  5.936522 -1.008387 0.056856
H  5.466462 0.264615 -1.070021
H  6.097032 0.685206 0.521172
H  4.400529 -1.484133 2.129339
H  4.769319 0.178229 2.567229
H  3.100943 -0.361538 2.506717
H  2.178576 1.564599 1.940985
H  0.051667 -3.245372 -0.144252
H  -0.177739 -2.995802 -1.87899
H  -0.142816 3.923319 0.992129
H  -1.015772 2.410274 1.112835
H  0.237533 2.796433 2.299697
H  -0.352609 2.178221 -1.320786
H  0.973749 3.305008 -1.482049
H  1.264725 1.579614 -1.702735
H  -2.620521 2.028276 -1.856625
H  -4.015501 0.996079 -2.057968
H  -4.079628 -0.660899 1.976092
H  -3.039886 0.718647 2.239825
H  -3.256689 2.682456 0.368224
H  -4.737404 2.752522 -0.566748
H  -5.366511 0.47593 0.278765
H  -5.18305 1.635388 1.580146
elementType: O N C H
totalener: -1094.86664915 hartree
nucrepener: 2238.88797980 hartree
electener: -3333.75462895 hartree
oneelecener: -5940.57599880 hartree
twoeener: 2606.82136985 hartree
cpcmener: -0.04279145 hartree
kineticenergy: 1090.03953558 hartree
xcener: -105.976429197386 hartree
chargesum: -0.0000000
charge: -0.286941 -0.481644 -0.433388 -0.430163 -0.087211 0.145309 -0.021058 -0.120062 -0.264871 -0.294529 -0.277683 0.416365 -0.011955 0.077100 -0.200984 -0.271525 -0.100924 -0.044362 -0.076758 -0.077468 -0.155437 -0.124477 0.304365 0.333680 0.115503 0.095856 0.096063 0.088173 0.095508 0.103638 0.098536 0.088691 0.128810 0.133403 0.144955 0.102039 0.059051 0.093569 0.073129 0.121745 0.094909 0.105808 0.111193 0.097881 0.102816 0.087210 0.086912 0.078215 0.081008
qa: -0.2869 -0.4816 -0.4334 -0.4302 -0.0872 0.1453 -0.0211 -0.1201 -0.2649 -0.2945 -0.2777 0.4164 -0.0120 0.0771 -0.2010 -0.2715 -0.1009 -0.0444 -0.0768 -0.0775 -0.1554 -0.1245 0.3044 0.3337 0.1155 0.0959 0.0961 0.0882 0.0955 0.1036 0.0985 0.0887 0.1288 0.1334 0.1450 0.1020 0.0591 0.0936 0.0731 0.1217 0.0949 0.1058 0.1112 0.0979 0.1028 0.0872 0.0869 0.0782 0.0810
va: 2.1058 2.0088 2.0689 2.0779 3.0756 3.7576 3.8012 3.8381 3.8968 3.8889 3.8356 4.0927 3.6733 3.9035 3.9225 3.9421 3.6685 3.5998 3.8957 3.9123 3.9147 3.9084 4.1721 4.1891 1.0033 1.0306 1.0024 1.0039 1.0022 0.9997 0.9994 1.0183 1.0015 1.0147 0.9950 0.9969 1.0022 1.0113 1.0072 0.9987 1.0085 1.0041 1.0043 1.0159 1.0038 1.0032 1.0112 1.0071 1.0104
dispcorr: -0.028820757 hartree
energy: -1094.895469904003
dipole: 6.43054 -7.13781 -0.70727 20.01493 -18.53866 1.47627 5.58695 -6.22346 -0.63651
magnitude: 1.75634 au
magnitude: 4.46427 debye
