program: Orca
programVersion: 5.0.2
elementType: O O O O N C C C C C C C C C C C C C C C C C C C H H H H H H H H H H H H H H H H H H H H H H H H H
charge: 0
multiplicity: 1
keywords: wb97x-d3
keywords: def2-TZVPP
keywords: def2/J RIJCOSX
keywords: DEFGRID2
keywords: scfconv7
keywords: smallprint printgap noloewdin
keywords: NOSOSCF
formula: C19H25NO4
InChI: InChI=1/C19H25NO4/c1-11(2)9-14-15(19(14,3)4)18(23)24-10-20-16(21)12-7-5-6-8-13(12)17(20)22/h9,14-15H,5-8,10H2,1-4H3
49 atoms
O  1.166594 -1.18007 -0.400244
O  2.650933 -2.414722 -1.506607
O  -0.947884 -1.768638 2.00361
O  -1.634248 -0.589513 -2.322921
N  -1.085308 -1.521495 -0.284488
C  3.706158 0.06286 0.882171
C  3.080612 1.030569 -0.061708
C  3.381048 -0.388308 -0.536573
C  5.179618 0.217577 1.174582
C  2.930417 -0.470355 2.061522
C  1.719511 1.587151 0.150122
C  2.385815 -1.421424 -0.861175
C  0.935533 2.083913 -0.809341
C  0.14257 -2.141268 -0.642986
C  -0.389456 2.7081 -0.493056
C  1.293927 2.047276 -2.262051
C  -2.616466 -0.345807 0.977008
C  -2.82228 -0.006109 -0.296809
C  -3.400439 0.15453 2.131431
C  -3.858766 0.941855 -0.769093
C  -4.666473 0.849189 1.627223
C  -4.385627 1.74418 0.421443
C  -1.472884 -1.285312 1.032028
C  -1.817148 -0.698337 -1.136328
H  3.776854 1.737305 -0.506771
H  4.248894 -0.480919 -1.17941
H  5.627964 -0.73855 1.450618
H  5.725232 0.606818 0.314444
H  5.332707 0.908027 2.006308
H  3.289936 -1.463758 2.335581
H  3.086918 0.181035 2.923482
H  1.857418 -0.538658 1.90176
H  1.365661 1.630541 1.176372
H  0.301888 -3.030425 -0.034414
H  0.105589 -2.429532 -1.692065
H  -1.189294 2.253403 -1.082349
H  -0.646508 2.618809 0.562405
H  -0.390137 3.770536 -0.751358
H  1.239809 3.045098 -2.704374
H  2.29014 1.650774 -2.450296
H  0.578893 1.428439 -2.811322
H  -3.647374 -0.666046 2.808804
H  -2.781258 0.847774 2.70954
H  -3.449797 1.601993 -1.537316
H  -4.667997 0.382098 -1.248586
H  -5.404482 0.0921 1.348136
H  -5.107156 1.434244 2.435002
H  -3.646866 2.502974 0.695903
H  -5.291628 2.276801 0.131036
elementType: O N C H
totalener: -1094.86491619 hartree
nucrepener: 2228.47184079 hartree
electener: -3323.33675699 hartree
oneelecener: -5918.74087271 hartree
twoeener: 2595.40411572 hartree
cpcmener: -0.03800731 hartree
kineticenergy: 1090.05753892 hartree
xcener: -105.977677860070 hartree
chargesum: -0.0000000
charge: -0.251573 -0.502858 -0.433301 -0.432331 -0.094629 0.140427 -0.014675 -0.160366 -0.270837 -0.281636 -0.255108 0.448076 -0.027091 0.068158 -0.239153 -0.265628 -0.036202 -0.065472 -0.070600 -0.085975 -0.131477 -0.135268 0.317242 0.295637 0.116127 0.096681 0.096555 0.088343 0.094117 0.104336 0.101637 0.074921 0.127499 0.145119 0.127187 0.077453 0.093359 0.114754 0.105956 0.093730 0.094531 0.096426 0.102057 0.101172 0.111564 0.077706 0.081298 0.078399 0.083715
qa: -0.2516 -0.5029 -0.4333 -0.4323 -0.0946 0.1404 -0.0147 -0.1604 -0.2708 -0.2816 -0.2551 0.4481 -0.0271 0.0682 -0.2392 -0.2656 -0.0362 -0.0655 -0.0706 -0.0860 -0.1315 -0.1353 0.3172 0.2956 0.1161 0.0967 0.0966 0.0883 0.0941 0.1043 0.1016 0.0749 0.1275 0.1451 0.1272 0.0775 0.0934 0.1148 0.1060 0.0937 0.0945 0.0964 0.1021 0.1012 0.1116 0.0777 0.0813 0.0784 0.0837
va: 2.1068 1.9952 2.0697 2.0634 3.1350 3.7355 3.7834 3.8970 3.9075 3.9141 3.8214 4.0712 3.6872 3.9037 3.9348 3.9474 3.6678 3.6418 3.9139 3.9037 3.9111 3.9109 4.1649 4.1585 1.0043 1.0281 1.0015 1.0050 1.0017 1.0012 0.9997 1.0098 0.9968 0.9968 1.0118 0.9958 1.0053 0.9980 0.9995 1.0046 1.0043 1.0133 1.0064 1.0072 1.0044 1.0067 1.0096 1.0086 1.0107
dispcorr: -0.028901691 hartree
energy: -1094.893817884529
dipole: 2.52120 -4.22754 -1.70634 19.49360 -17.47245 2.02114 6.46371 -5.31363 1.15008
magnitude: 2.88432 au
magnitude: 7.33135 debye
