program: Orca
programVersion: 5.0.2
elementType: O O O O N C C C C C C C C C C C C C C C C C C C H H H H H H H H H H H H H H H H H H H H H H H H H
charge: 0
multiplicity: 1
keywords: wb97x-d3
keywords: def2-TZVPP
keywords: def2/J RIJCOSX
keywords: DEFGRID2
keywords: scfconv7
keywords: smallprint printgap noloewdin
keywords: NOSOSCF
formula: C19H25NO4
InChI: InChI=1/C19H25NO4/c1-11(2)9-14-15(19(14,3)4)18(23)24-10-20-16(21)12-7-5-6-8-13(12)17(20)22/h9,14-15H,5-8,10H2,1-4H3
49 atoms
O  1.17302 -1.391238 -0.481258
O  2.631057 -2.634158 -1.617297
O  -1.333693 -0.534112 -2.5392
O  -1.238895 -1.900844 1.787276
N  -1.099367 -1.577154 -0.493376
C  3.550572 0.061786 0.677864
C  3.034932 0.880852 -0.458157
C  3.371705 -0.586443 -0.690948
C  4.9912 0.28095 1.076745
C  2.680605 -0.325962 1.84958
C  1.651811 1.410637 -0.580964
C  2.377782 -1.632666 -0.980439
C  1.075689 2.286947 0.245318
C  0.103542 -2.290547 -0.75402
C  -0.314399 2.787158 -0.011831
C  1.732914 2.846851 1.468744
C  -2.69796 0.078447 -0.636662
C  -2.660896 -0.313403 0.638466
C  -3.619051 1.099971 -1.190155
C  -3.519509 0.226048 1.720316
C  -4.733627 1.379905 -0.180616
C  -4.191887 1.514406 1.241509
C  -1.659539 -0.665179 -1.385852
C  -1.609434 -1.347956 0.782211
H  3.783963 1.527089 -0.911586
H  4.294789 -0.773513 -1.226652
H  5.06566 1.107537 1.786477
H  5.403698 -0.60804 1.557314
H  5.620628 0.520593 0.21882
H  2.903536 -1.344417 2.173154
H  2.900527 0.331685 2.691298
H  1.614978 -0.256779 1.655151
H  1.096731 1.104911 -1.462962
H  0.163392 -3.16277 -0.10383
H  0.112267 -2.619109 -1.792308
H  -0.33128 3.877528 -0.096185
H  -0.738825 2.370137 -0.925919
H  -0.981927 2.531507 0.816588
H  1.194007 2.550951 2.372621
H  2.771443 2.540028 1.579196
H  1.709606 3.939658 1.441682
H  -3.052463 2.011987 -1.405463
H  -4.029647 0.765826 -2.145517
H  -4.26828 -0.524114 1.993778
H  -2.927961 0.404179 2.621065
H  -5.265162 2.288331 -0.467331
H  -5.461941 0.564688 -0.214577
H  -4.997766 1.781336 1.925989
H  -3.465144 2.331333 1.275309
elementType: O N C H
totalener: -1094.86411989 hartree
nucrepener: 2229.29821011 hartree
electener: -3324.16233001 hartree
oneelecener: -5920.13413306 hartree
twoeener: 2595.97180305 hartree
cpcmener: -0.03864281 hartree
kineticenergy: 1090.04045497 hartree
xcener: -105.975810801903 hartree
chargesum: 0.0000000
charge: -0.251523 -0.501849 -0.432141 -0.433495 -0.096263 0.078948 0.007843 -0.095522 -0.275197 -0.284763 -0.272796 0.413660 -0.011747 0.072169 -0.245169 -0.267253 -0.074800 -0.035757 -0.082663 -0.069022 -0.124879 -0.153485 0.302190 0.317312 0.115683 0.094386 0.091997 0.099293 0.088703 0.117288 0.096686 0.087207 0.118983 0.141702 0.128788 0.111001 0.088050 0.091180 0.102387 0.094495 0.107970 0.107915 0.101342 0.106032 0.094593 0.081839 0.079945 0.085451 0.083284
qa: -0.2515 -0.5018 -0.4321 -0.4335 -0.0963 0.0789 0.0078 -0.0955 -0.2752 -0.2848 -0.2728 0.4137 -0.0117 0.0722 -0.2452 -0.2673 -0.0748 -0.0358 -0.0827 -0.0690 -0.1249 -0.1535 0.3022 0.3173 0.1157 0.0944 0.0920 0.0993 0.0887 0.1173 0.0967 0.0872 0.1190 0.1417 0.1288 0.1110 0.0880 0.0912 0.1024 0.0945 0.1080 0.1079 0.1013 0.1060 0.0946 0.0818 0.0799 0.0855 0.0833
va: 2.1029 1.9974 2.0640 2.0686 3.1412 3.7033 3.7684 3.8611 3.9146 3.8842 3.8465 4.1094 3.6559 3.8997 3.9401 3.9401 3.6411 3.6535 3.9120 3.9022 3.8999 3.9180 4.1613 4.1717 1.0040 1.0261 1.0031 1.0000 1.0055 1.0012 0.9992 1.0074 1.0171 0.9992 1.0102 0.9989 1.0057 0.9942 0.9949 1.0034 1.0008 1.0046 1.0165 1.0034 1.0162 1.0101 1.0068 1.0109 1.0069
dispcorr: -0.029324324 hartree
energy: -1094.893444216547
dipole: 2.77743 -4.44602 -1.66858 22.40080 -20.11182 2.28897 12.84376 -11.47806 1.36570
magnitude: 3.14463 au
magnitude: 7.99302 debye
