program: Orca
programVersion: 5.0.2
elementType: O O O O N C C C C C C C C C C C C C C C C C C C H H H H H H H H H H H H H H H H H H H H H H H H H
charge: 0
multiplicity: 1
keywords: wb97x-d3
keywords: def2-TZVPP
keywords: def2/J RIJCOSX
keywords: DEFGRID2
keywords: scfconv7
keywords: smallprint printgap noloewdin
keywords: NOSOSCF
formula: C19H25NO4
InChI: InChI=1/C19H25NO4/c1-11(2)9-14-15(19(14,3)4)18(23)24-10-20-16(21)12-7-5-6-8-13(12)17(20)22/h9,14-15H,5-8,10H2,1-4H3
49 atoms
O  1.181359 -1.20362 -0.338229
O  2.624259 -2.43784 -1.500301
O  -0.971016 -1.660159 2.069183
O  -1.609048 -0.656551 -2.309241
N  -1.078679 -1.5017 -0.228435
C  3.759223 0.050678 0.842436
C  3.093295 1.011021 -0.081253
C  3.385928 -0.408279 -0.56159
C  5.241375 0.217299 1.078671
C  3.033664 -0.487014 2.051208
C  1.734634 1.555943 0.170995
C  2.381775 -1.444321 -0.846726
C  0.932526 2.073954 -0.76199
C  0.1420 -2.153856 -0.55235
C  -0.391894 2.679562 -0.408596
C  1.267563 2.079626 -2.22088
C  -2.641972 -0.299262 0.964973
C  -2.831944 -0.008908 -0.323251
C  -3.449251 0.234711 2.087916
C  -3.869802 0.91085 -0.846178
C  -4.717068 0.890238 1.538201
C  -4.428662 1.746387 0.306348
C  -1.48762 -1.221497 1.072139
C  -1.806534 -0.720387 -1.121577
H  3.768582 1.720428 -0.553296
H  4.229908 -0.498776 -1.235749
H  5.751002 0.606974 0.197014
H  5.420906 0.911964 1.90147
H  5.706878 -0.734557 1.340915
H  3.410087 -1.478245 2.309556
H  3.22072 0.164731 2.906812
H  1.955416 -0.562371 1.935117
H  1.396535 1.566986 1.203351
H  0.282242 -3.021266 0.091126
H  0.10619 -2.482577 -1.589483
H  -0.399501 3.751459 -0.6244
H  -1.195405 2.244847 -1.008055
H  -0.638596 2.547036 0.644828
H  0.547895 1.46932 -2.773979
H  1.198661 3.088255 -2.636032
H  2.26318 1.69554 -2.436176
H  -3.694533 -0.561968 2.793764
H  -2.84874 0.959683 2.646524
H  -3.452772 1.549628 -1.628048
H  -4.663171 0.326326 -1.322491
H  -5.438404 0.112046 1.27447
H  -5.180543 1.496372 2.317039
H  -3.70594 2.525526 0.566306
H  -5.33698 2.254981 -0.017965
elementType: O N C H
totalener: -1094.86481477 hartree
nucrepener: 2226.72452629 hartree
electener: -3321.58934106 hartree
oneelecener: -5915.24683827 hartree
twoeener: 2593.65749721 hartree
cpcmener: -0.03817990 hartree
kineticenergy: 1090.05754780 hartree
xcener: -105.978000589446 hartree
chargesum: 0.0000000
charge: -0.251452 -0.502760 -0.434528 -0.433044 -0.093124 0.139869 -0.018151 -0.159223 -0.270532 -0.282698 -0.251561 0.449618 -0.026553 0.066062 -0.242034 -0.265817 -0.039387 -0.071088 -0.069436 -0.083276 -0.131560 -0.137019 0.318700 0.301742 0.116018 0.096092 0.088338 0.094138 0.096579 0.104488 0.101521 0.076308 0.127692 0.146286 0.126079 0.115478 0.078081 0.094147 0.094954 0.105531 0.093122 0.096785 0.102213 0.099665 0.111946 0.077730 0.081385 0.078610 0.084064
qa: -0.2515 -0.5028 -0.4345 -0.4330 -0.0931 0.1399 -0.0182 -0.1592 -0.2705 -0.2827 -0.2516 0.4496 -0.0266 0.0661 -0.2420 -0.2658 -0.0394 -0.0711 -0.0694 -0.0833 -0.1316 -0.1370 0.3187 0.3017 0.1160 0.0961 0.0883 0.0941 0.0966 0.1045 0.1015 0.0763 0.1277 0.1463 0.1261 0.1155 0.0781 0.0941 0.0950 0.1055 0.0931 0.0968 0.1022 0.0997 0.1119 0.0777 0.0814 0.0786 0.0841
va: 2.1048 1.9953 2.0683 2.0631 3.1345 3.7400 3.7823 3.8977 3.9069 3.9119 3.8192 4.0727 3.6891 3.9022 3.9390 3.9474 3.6632 3.6413 3.9125 3.9016 3.9101 3.9122 4.1622 4.1537 1.0040 1.0281 1.0050 1.0017 1.0016 1.0011 0.9995 1.0114 0.9972 0.9960 1.0135 0.9975 0.9939 1.0046 1.0041 0.9992 1.0051 1.0133 1.0065 1.0086 1.0042 1.0068 1.0095 1.0081 1.0108
dispcorr: -0.028858255 hartree
energy: -1094.893673022895
dipole: 2.59241 -4.29545 -1.70304 19.47607 -17.46333 2.01273 5.98130 -4.88252 1.09878
magnitude: 2.85635 au
magnitude: 7.26027 debye
