program: Orca
programVersion: 5.0.2
elementType: O O O O N C C C C C C C C C C C C C C C C C C C H H H H H H H H H H H H H H H H H H H H H H H H H
charge: 0
multiplicity: 1
keywords: wb97x-d3
keywords: def2-TZVPP
keywords: def2/J RIJCOSX
keywords: DEFGRID2
keywords: scfconv7
keywords: smallprint printgap noloewdin
keywords: NOSOSCF
formula: C19H25NO4
InChI: InChI=1/C19H25NO4/c1-11(2)9-14-15(19(14,3)4)18(23)24-10-20-16(21)12-7-5-6-8-13(12)17(20)22/h9,14-15H,5-8,10H2,1-4H3
49 atoms
O  1.084764 -1.684203 -1.160471
O  0.691098 0.51297 -1.063242
O  -2.139835 0.185916 -2.299397
O  -0.928835 -2.951486 0.761488
N  -1.272353 -1.537654 -1.025916
C  2.611665 0.009554 1.457212
C  3.334726 0.839991 0.450386
C  2.634361 -0.428212 -0.002406
C  3.430449 -0.836365 2.400402
C  1.32404 0.505051 2.067166
C  2.901782 2.217199 0.097684
C  1.391031 -0.429772 -0.79118
C  3.07749 2.80786 -1.085672
C  -0.148959 -1.916529 -1.824394
C  2.654554 4.225957 -1.318547
C  3.666514 2.113364 -2.273505
C  -2.929422 -0.261708 -0.059424
C  -2.590798 -1.193984 0.831575
C  -3.959289 0.784553 0.149239
C  -3.197119 -1.353324 2.175292
C  -4.30982 0.860498 1.636504
C  -4.481704 -0.525889 2.256321
C  -2.101279 -0.446468 -1.276994
C  -1.511045 -2.028496 0.251076
H  4.414635 0.708729 0.459028
H  3.278318 -1.276014 -0.208109
H  4.35751 -1.179317 1.939105
H  3.696862 -0.266389 3.293278
H  2.873338 -1.717827 2.724331
H  0.752455 1.162313 1.415406
H  0.680964 -0.334729 2.340731
H  1.537164 1.06211 2.981952
H  2.450162 2.797714 0.897675
H  -0.161102 -2.986239 -2.01905
H  -0.202662 -1.385498 -2.774927
H  2.234116 4.682748 -0.422402
H  3.495816 4.841506 -1.648165
H  1.901677 4.283474 -2.109539
H  4.531562 2.661558 -2.655989
H  3.985623 1.094143 -2.06218
H  2.942688 2.073707 -3.092316
H  -3.599877 1.748972 -0.217463
H  -4.845602 0.546727 -0.44795
H  -3.39662 -2.407402 2.382524
H  -2.476973 -1.029163 2.934084
H  -3.516015 1.396918 2.164489
H  -5.221846 1.444519 1.767821
H  -5.284221 -1.057403 1.736897
H  -4.791842 -0.434158 3.29821
elementType: O N C H
totalener: -1094.87380605 hartree
nucrepener: 2191.45724949 hartree
electener: -3286.33105554 hartree
oneelecener: -5845.94729724 hartree
twoeener: 2559.61624170 hartree
cpcmener: -0.03276587 hartree
kineticenergy: 1090.04751723 hartree
xcener: -105.972969373681 hartree
chargesum: 0.0000000
charge: -0.279735 -0.449102 -0.400948 -0.411110 -0.106167 0.151735 -0.024816 -0.128146 -0.265209 -0.306619 -0.257433 0.389425 -0.028371 0.086966 -0.225441 -0.268373 -0.034605 -0.094881 -0.076015 -0.068525 -0.135612 -0.138005 0.299514 0.309707 0.114950 0.098548 0.086572 0.093750 0.096178 0.096990 0.096309 0.105920 0.121495 0.140648 0.132714 0.087574 0.094321 0.094374 0.104608 0.093370 0.098312 0.093542 0.099744 0.093732 0.099897 0.078700 0.080905 0.077831 0.080778
qa: -0.2797 -0.4491 -0.4009 -0.4111 -0.1062 0.1517 -0.0248 -0.1281 -0.2652 -0.3066 -0.2574 0.3894 -0.0284 0.0870 -0.2254 -0.2684 -0.0346 -0.0949 -0.0760 -0.0685 -0.1356 -0.1380 0.2995 0.3097 0.1150 0.0985 0.0866 0.0938 0.0962 0.0970 0.0963 0.1059 0.1215 0.1406 0.1327 0.0876 0.0943 0.0944 0.1046 0.0934 0.0983 0.0935 0.0997 0.0937 0.0999 0.0787 0.0809 0.0778 0.0808
va: 2.1110 2.0414 2.1155 2.1013 3.0672 3.7329 3.8518 3.8133 3.9000 3.9085 3.8507 4.1227 3.7087 3.9007 3.9263 3.9478 3.6174 3.6943 3.9141 3.9179 3.9137 3.9172 4.2180 4.1982 1.0033 1.0290 1.0050 1.0019 1.0020 1.0103 1.0070 1.0002 0.9994 0.9917 1.0141 1.0074 0.9966 0.9962 1.0001 1.0037 0.9982 1.0159 1.0046 1.0157 1.0061 1.0071 1.0093 1.0062 1.0094
dispcorr: -0.025900600 hartree
energy: -1094.899706649154
dipole: 9.52567 -9.89295 -0.36727 15.95785 -15.97877 -0.02092 11.83438 -10.64641 1.18796
magnitude: 1.24362 au
magnitude: 3.16103 debye
