program: Orca
programVersion: 5.0.2
elementType: O O O O N C C C C C C C C C C C C C C C C C C C H H H H H H H H H H H H H H H H H H H H H H H H H
charge: 0
multiplicity: 1
keywords: wb97x-d3
keywords: def2-TZVPP
keywords: def2/J RIJCOSX
keywords: DEFGRID2
keywords: scfconv7
keywords: smallprint printgap noloewdin
keywords: NOSOSCF
formula: C19H25NO4
InChI: InChI=1/C19H25NO4/c1-11(2)9-14-15(19(14,3)4)18(23)24-10-20-16(21)12-7-5-6-8-13(12)17(20)22/h9,14-15H,5-8,10H2,1-4H3
49 atoms
O  1.16278 -1.306998 -0.573841
O  2.698283 -2.832956 -1.091585
O  -1.245784 0.047728 -2.364195
O  -1.370586 -2.436646 1.431412
N  -1.099677 -1.493074 -0.655252
C  3.171445 0.08242 1.12144
C  3.296371 0.709078 -0.230602
C  3.403719 -0.803876 -0.095367
C  4.364758 0.194785 2.041957
C  1.858601 0.081262 1.873053
C  2.184375 1.368514 -0.965687
C  2.411802 -1.749052 -0.635204
C  1.604779 2.516873 -0.606721
C  0.105802 -2.140568 -1.03853
C  0.526949 3.136032 -1.445082
C  1.962427 3.281564 0.630598
C  -2.686438 0.161336 -0.42082
C  -2.732779 -0.578658 0.688704
C  -3.547922 1.336549 -0.697306
C  -3.671534 -0.370236 1.817912
C  -4.230517 1.781391 0.598064
C  -4.779234 0.595683 1.3909
C  -1.61992 -0.375768 -1.301046
C  -1.685518 -1.624937 0.600536
H  4.269559 1.156692 -0.424004
H  4.406532 -1.205286 -0.184917
H  4.377797 -0.622088 2.766668
H  5.30925 0.171443 1.496671
H  4.327882 1.132103 2.601869
H  1.001841 0.359302 1.265113
H  1.655049 -0.89333 2.322969
H  1.918156 0.803481 2.690449
H  1.872089 0.912789 -1.900682
H  0.147835 -3.129614 -0.582729
H  0.143992 -2.244872 -2.123288
H  -0.408548 3.215416 -0.882992
H  0.794782 4.154362 -1.740874
H  0.3272 2.565957 -2.351973
H  1.089673 3.411015 1.276004
H  2.749001 2.809987 1.216819
H  2.301765 4.288411 0.371185
H  -2.956228 2.148789 -1.126916
H  -4.290413 1.071246 -1.457005
H  -4.091147 -1.325276 2.144021
H  -3.119846 0.0239 2.677884
H  -3.510174 2.327511 1.214355
H  -5.035248 2.480475 0.365334
H  -5.508641 0.057769 0.778404
H  -5.314827 0.949839 2.272938
elementType: O N C H
totalener: -1094.87349660 hartree
nucrepener: 2210.24076127 hartree
electener: -3305.11425787 hartree
oneelecener: -5882.19222506 hartree
twoeener: 2577.07796718 hartree
cpcmener: -0.03113778 hartree
kineticenergy: 1090.03171735 hartree
xcener: -105.969129487806 hartree
chargesum: 0.0000000
charge: -0.248576 -0.470175 -0.406996 -0.406868 -0.099458 0.092134 -0.000332 -0.086431 -0.272265 -0.290815 -0.259109 0.384282 -0.016731 0.074066 -0.251025 -0.259067 -0.040186 -0.040443 -0.080185 -0.069735 -0.130714 -0.137227 0.281293 0.280999 0.114292 0.091962 0.100546 0.086566 0.088600 0.084809 0.114865 0.099786 0.109561 0.128273 0.139339 0.092489 0.105666 0.090176 0.098793 0.090223 0.107468 0.091128 0.104340 0.094505 0.101504 0.077965 0.080519 0.078474 0.081714
qa: -0.2486 -0.4702 -0.4070 -0.4069 -0.0995 0.0921 -0.0003 -0.0864 -0.2723 -0.2908 -0.2591 0.3843 -0.0167 0.0741 -0.2510 -0.2591 -0.0402 -0.0404 -0.0802 -0.0697 -0.1307 -0.1372 0.2813 0.2810 0.1143 0.0920 0.1005 0.0866 0.0886 0.0848 0.1149 0.0998 0.1096 0.1283 0.1393 0.0925 0.1057 0.0902 0.0988 0.0902 0.1075 0.0911 0.1043 0.0945 0.1015 0.0780 0.0805 0.0785 0.0817
va: 2.0976 2.0382 2.0970 2.1030 3.1395 3.6752 3.7892 3.8625 3.9152 3.8878 3.8525 4.1506 3.6558 3.9048 3.9297 3.9395 3.6712 3.6597 3.9168 3.9145 3.9094 3.9171 4.1957 4.2087 1.0050 1.0258 0.9997 1.0059 1.0032 1.0053 1.0052 0.9996 1.0239 1.0078 0.9984 0.9924 0.9996 1.0112 0.9969 1.0057 1.0006 1.0139 1.0054 1.0147 1.0056 1.0078 1.0096 1.0066 1.0095
dispcorr: -0.027839964 hartree
energy: -1094.901336564194
dipole: 1.87543 -3.57548 -1.70005 23.64884 -21.43138 2.21746 11.71722 -10.52816 1.18906
magnitude: 3.03664 au
magnitude: 7.71852 debye
