program: Orca
programVersion: 5.0.2
elementType: O O O O N C C C C C C C C C C C C C C C C C C C H H H H H H H H H H H H H H H H H H H H H H H H H
charge: 0
multiplicity: 1
keywords: wb97x-d3
keywords: def2-TZVPP
keywords: def2/J RIJCOSX
keywords: DEFGRID2
keywords: scfconv7
keywords: smallprint printgap noloewdin
keywords: NOSOSCF
formula: C19H25NO4
InChI: InChI=1/C19H25NO4/c1-11(2)9-14-15(19(14,3)4)18(23)24-10-20-16(21)12-7-5-6-8-13(12)17(20)22/h9,14-15H,5-8,10H2,1-4H3
49 atoms
O  1.213962 -1.861799 -1.109141
O  1.233482 -1.333106 1.060728
O  -1.09893 -0.355578 -2.544924
O  -1.664902 -2.41533 1.469173
N  -1.09302 -1.639104 -0.63233
C  4.012475 -0.079925 0.608507
C  3.108067 0.916778 -0.034888
C  2.991469 -0.577125 -0.389267
C  5.436155 -0.119356 0.101094
C  3.919587 -0.399854 2.081202
C  2.022778 1.620814 0.683469
C  1.754022 -1.281352 -0.025423
C  1.113731 2.411974 0.104012
C  -0.028503 -2.531103 -0.968372
C  0.061052 3.101313 0.915491
C  1.035814 2.661696 -1.371008
C  -2.542417 0.150552 -0.666383
C  -2.706087 -0.457562 0.508893
C  -3.281312 1.356033 -1.11307
C  -3.674252 -0.048427 1.554706
C  -4.000531 1.986245 0.080675
C  -4.680408 0.937646 0.959767
C  -1.512745 -0.589433 -1.437459
C  -1.782967 -1.618024 0.576334
H  3.556649 1.483132 -0.844995
H  3.375307 -0.840732 -1.367988
H  5.876629 -1.10733 0.249179
H  5.499501 0.11526 -0.96261
H  6.054299 0.604008 0.636293
H  2.928092 -0.284861 2.5075
H  4.240126 -1.426307 2.269045
H  4.593427 0.257424 2.634421
H  1.97284 1.496143 1.760014
H  0.018262 -3.317169 -0.214359
H  -0.209127 -2.987147 -1.939318
H  0.136996 4.187686 0.819071
H  -0.940545 2.831675 0.567281
H  0.125611 2.851165 1.974514
H  0.159306 2.165593 -1.796453
H  0.917191 3.72745 -1.579188
H  1.906064 2.309021 -1.922026
H  -2.598693 2.070991 -1.57883
H  -3.996628 1.073948 -1.89204
H  -4.181465 -0.924471 1.965685
H  -3.132239 0.40502 2.390717
H  -3.27774 2.546644 0.68093
H  -4.735458 2.708975 -0.27653
H  -5.414523 0.386867 0.364537
H  -5.234107 1.424773 1.763876
elementType: O N C H
totalener: -1094.87514953 hartree
nucrepener: 2222.63291459 hartree
electener: -3317.50806412 hartree
oneelecener: -5908.01622469 hartree
twoeener: 2590.50816057 hartree
cpcmener: -0.03319860 hartree
kineticenergy: 1090.05218690 hartree
xcener: -105.975228343152 hartree
chargesum: -0.0000000
charge: -0.282190 -0.456380 -0.412029 -0.402215 -0.093104 0.144240 -0.050213 -0.097100 -0.261842 -0.289415 -0.240869 0.395118 -0.034969 0.082728 -0.210688 -0.257131 -0.104532 -0.039960 -0.088823 -0.070837 -0.144766 -0.132835 0.304646 0.312311 0.109325 0.092219 0.095473 0.086363 0.094710 0.091508 0.101476 0.096385 0.125910 0.131344 0.141887 0.101673 0.064231 0.091559 0.080783 0.101460 0.093772 0.100069 0.109650 0.093955 0.100058 0.084102 0.084017 0.077881 0.081045
qa: -0.2822 -0.4564 -0.4120 -0.4022 -0.0931 0.1442 -0.0502 -0.0971 -0.2618 -0.2894 -0.2409 0.3951 -0.0350 0.0827 -0.2107 -0.2571 -0.1045 -0.0400 -0.0888 -0.0708 -0.1448 -0.1328 0.3046 0.3123 0.1093 0.0922 0.0955 0.0864 0.0947 0.0915 0.1015 0.0964 0.1259 0.1313 0.1419 0.1017 0.0642 0.0916 0.0808 0.1015 0.0938 0.1001 0.1096 0.0940 0.1001 0.0841 0.0840 0.0779 0.0810
va: 2.1116 2.0404 2.0970 2.1146 3.0754 3.7678 3.8013 3.8384 3.8948 3.8886 3.8349 4.1233 3.7156 3.8974 3.9283 3.9422 3.6682 3.6134 3.9080 3.9109 3.9110 3.9095 4.1865 4.2170 1.0050 1.0312 1.0027 1.0042 1.0025 1.0212 0.9998 1.0001 1.0031 1.0158 0.9928 0.9997 0.9974 1.0090 1.0100 1.0000 1.0101 1.0094 1.0061 1.0155 1.0059 1.0027 1.0109 1.0070 1.0096
dispcorr: -0.027420286 hartree
energy: -1094.902569813480
dipole: 6.99397 -7.62900 -0.63503 20.81933 -19.51720 1.30214 5.41736 -5.91290 -0.49553
magnitude: 1.53114 au
magnitude: 3.89184 debye
