program: Gaussian 09
title: 000073316
version: EM64L-G09RevD.01
frameworkgroup: C1[X(C11H18N2O5)]
method: RPBEPBE
basis: SDD
operation: Freq
keyword: #p
keyword: freq=noraman
keyword: PBEPBE/SDD
title: #p freq=noraman PBEPBE/SDD
converged: YES YES NO NO
title: Mulliken charges:
elementType: O O O O O N N C C C C C C C C C C C H H H H H H H H H H H H H H H H H H
charge: -0.281465 -0.450653 -0.437393 -0.251299 -0.290037 -0.170071 -0.382274 -0.014791 -0.510210 -0.114593 -0.072189 -0.389250 -0.287464 0.235395 0.389878 -0.195695 -0.813897 -0.517574 0.285745 0.243651 0.276541 0.246644 0.226388 0.228323 0.218505 0.259162 0.212096 0.338035 0.332737 0.250088 0.222142 0.220186 0.341465 0.242707 0.196687 0.212478
chargesum: 0.00000
title: Mulliken charges with hydrogens summed into heavy atoms:
elementType: O O O O O N N C C C C C C C C C C C
charge: -0.281465 -0.112618 -0.095928 -0.251299 -0.290037 -0.170071 -0.049536 0.270954 0.009983 0.132052 0.154199 0.057579 -0.028302 0.235395 0.389878 0.016401 -0.121481 0.134298
polarizability: 1.99267933e+02 8.49681071e+00 1.48564280e+02 4.16019912e+00 3.69796775e+00 1.06331201e+02
1716.lowfreq: -2.4423 -0.0013 -0.0012 -0.0010 9.4240 15.4476 28.0738 32.0020 47.0162
frequency: 27.9314 31.8889 46.9978 69.4704 88.8225 95.2135 114.3667 124.5465 161.4410 174.4429 176.5871 202.2784 211.2635 241.1186 259.6009 277.5550 278.9908 288.1852 307.0205 350.0790 397.4942 421.4156 456.1789 460.8318 469.0744 486.7312 540.4420 552.9926 585.9776 622.0436 647.2238 717.8586 724.6367 741.5812 823.4406 828.9995 836.0087 840.3403 877.7252 890.1531 913.9346 950.0315 951.8168 977.0514 985.1958 1006.1016 1027.1127 1045.2749 1049.3530 1057.5320 1075.4144 1089.9843 1106.9427 1130.0247 1139.0043 1147.9148 1161.2385 1189.7304 1225.6805 1239.3540 1245.6579 1263.5996 1287.2371 1303.0555 1312.7115 1320.2032 1322.4109 1333.6245 1361.9673 1365.7123 1376.2483 1390.1973 1398.5352 1418.2520 1427.1739 1442.2119 1450.0736 1458.0980 1459.2847 1468.3711 1479.6314 1480.3580 1640.7479 1706.0762 2927.2603 2936.5162 2964.0313 2970.1307 2997.0138 3008.6908 3009.0054 3031.9128 3041.4150 3069.4240 3079.9943 3083.1851 3104.8139 3113.5942 3165.2436 3560.8492 3565.2770 3569.7200
redmass: 5.2970 4.4029 5.8418 3.5313 3.4408 3.6103 3.9349 3.1235 4.6232 1.6144 1.5772 1.4377 3.5026 5.2685 2.3662 1.2802 2.1097 3.7335 1.4784 4.3026 3.2954 4.1711 3.9084 4.6114 4.1520 3.3630 3.6234 5.0221 3.7181 1.4159 5.9554 6.1950 8.0183 4.7058 4.0716 2.9059 4.1043 3.9526 1.5357 2.7770 2.9211 2.9128 2.5564 3.6371 7.9992 2.4131 2.3555 1.7053 1.5376 2.3979 2.4530 2.0043 1.3048 1.9958 1.4139 1.4864 1.3388 1.4087 1.7507 1.7066 1.5270 3.2405 1.2813 1.3978 1.3945 1.4087 1.2060 1.4225 1.2379 1.7392 1.4461 1.8400 1.2748 1.8812 1.1544 1.7928 1.1124 1.0609 1.0644 1.0829 1.0563 1.0865 6.1028 7.0436 1.0365 1.0834 1.0388 1.0855 1.0624 1.0832 1.1011 1.0681 1.0951 1.0858 1.1029 1.0989 1.0970 1.1012 1.0931 1.0767 1.0662 1.0665
irintensity: 0.5767 1.0348 0.7430 2.2184 1.3695 5.6139 2.6404 3.5950 1.8803 1.6133 1.9256 4.1985 19.8765 2.9838 10.4593 169.3891 40.0845 3.6091 97.1294 7.7790 9.3474 19.4747 3.0524 10.5467 17.9252 18.1591 15.3044 8.5501 13.1552 71.8185 11.0120 17.2115 27.8880 1.6472 73.7405 35.1259 74.7822 2.4472 65.3434 56.4954 17.8694 17.2484 124.0718 268.8389 86.1317 87.0459 16.3601 30.0616 8.1224 14.3611 7.5808 5.3115 1.2016 12.2561 12.4733 43.1458 44.6488 8.9020 79.2483 168.0741 54.1926 17.7543 34.5986 12.6563 11.7983 46.8603 16.2356 20.1218 14.4218 17.0720 3.9363 57.6166 8.7345 65.3417 9.0786 71.1867 13.6406 10.9526 16.4097 7.8957 8.2394 11.4560 418.4154 108.5470 76.7643 83.3588 53.5060 60.6262 38.0012 23.5872 59.6604 18.0748 20.0138 3.5870 36.6660 21.3133 23.6931 6.8178 9.1288 28.9510 4.6298 9.5711
temp: 298.150 k
press: 1.00000 atm
elementType: 8 8 8 8 8 7 7 6 6 6 6 6 6 6 6 6 6 6 1 1 1 1 1 1 1 1 1 1 1 1 1 1 1 1 1 1
symmnumber: 1
zpe: 764576.2 jmol-1
zpe.correction: 0.291212 hartree
zpe.thermalcorrener: 0.310241 hartree
zpe.thermalcorrenthalpy: 0.311185 hartree
zpe.thermalcorrgfe: 0.243045 hartree
zpe.sumelectzpe: -914.146759 hartree
zpe.sumelectthermal: -914.127730 hartree
zpe.sumelectthermalent: -914.126786 hartree
zpe.sumelectthermalfe: -914.194926 hartree
dipole: 0.2364 3.0334 -0.4429
dipole: 3.0747
quadrupole: -72.4347 -118.2653 -111.2599
quadrupole: 2.4960 3.1006 -5.6689
quadrupole: 28.2186 -17.6120 -10.6066 2.4960 3.1006 -5.6689
hfenergy: -914.4379707 hartree
pointgroup: C01 [X(C11H18N2O5)]
dipole: -0.1391322 1.1841678 0.2041489 debye
polarizability: 199.89777|-6.5829688|148.1207593|3.6915572|-2.4692416|106.1448851 unknown
InChI: InChI=1S/C11H18N2O5/c1-6-4-13(11(16)12-10(6)17-2)9-3-7(15)8(5-14)18-9/h4,7-10,12,14-15H,3,5H2,1-2H3
charge 0 multiplicity 1
36 atoms
O  1.853447 -0.011095 1.070567
O  3.622367 -1.830569 -0.971372
O  4.824748 1.996117 -0.046187
O  -3.742631 0.200934 -1.005321
O  -1.005746 -2.580352 1.010218
N  -0.38633 -0.412407 0.303269
N  -2.616567 -0.896865 0.898185
C  1.005903 -0.81503 0.132211
C  1.613756 -0.540257 -1.260144
C  3.118914 -0.446248 -0.972524
C  3.178257 0.201292 0.441568
C  3.449403 1.717107 0.39984
C  -0.756902 0.944081 0.165242
C  -1.316806 -1.38192 0.744406
C  -2.045875 1.377361 0.216877
C  -3.143168 0.35155 0.354552
C  -2.448675 2.824716 0.081109
C  -4.974572 -0.596272 -1.006039
H  1.064825 -1.881841 0.403854
H  1.231414 0.410305 -1.672085
H  1.398432 -1.351033 -1.972403
H  3.673804 0.167582 -1.707846
H  3.943515 -0.305077 1.066605
H  3.237473 2.158704 1.393576
H  2.804317 2.208979 -0.348085
H  0.081424 1.637257 0.05894
H  -3.95802 0.70207 1.027397
H  4.591657 -1.825457 -0.767645
H  -3.265219 -1.589519 1.275614
H  -3.145215 2.952173 -0.768526
H  -1.573309 3.475414 -0.088898
H  -2.969018 3.190624 0.988962
H  5.45325 1.78889 0.690289
H  -5.388424 -0.512874 -2.022966
H  -5.715579 -0.203785 -0.275673
H  -4.775448 -1.665455 -0.787067
