program: Orca
programVersion: 5.0.2
elementType: O O O O N C C C C C C C C C C C C C C C C C C C H H H H H H H H H H H H H H H H H H H H H H H H H
charge: 0
multiplicity: 1
keywords: wb97x-d3
keywords: def2-TZVPP
keywords: def2/J RIJCOSX
keywords: DEFGRID2
keywords: scfconv7
keywords: smallprint printgap noloewdin
keywords: NOSOSCF
formula: C19H25NO4
InChI: InChI=1/C19H25NO4/c1-11(2)9-14-15(19(14,3)4)18(23)24-10-20-16(21)12-7-5-6-8-13(12)17(20)22/h9,14-15H,5-8,10H2,1-4H3
49 atoms
O  0.427974 -0.155078 0.100689
O  2.218919 -0.780156 1.272586
O  -1.435978 -2.6770 -1.159853
O  -2.626753 0.830304 1.472138
N  -1.699232 -0.967201 0.364252
C  3.788023 0.314455 -1.223306
C  3.746702 1.421709 -0.229753
C  2.451648 0.701014 -0.60722
C  3.937902 0.689201 -2.679151
C  4.447297 -1.000254 -0.887279
C  4.363929 1.315664 1.115843
C  1.742004 -0.151153 0.357887
C  3.993873 2.031317 2.180734
C  -0.398386 -0.964871 0.934289
C  4.691365 1.890424 3.498597
C  2.845521 2.992148 2.163421
C  -3.478332 -1.382459 -1.038611
C  -3.830774 -0.358583 -0.259955
C  -4.327895 -1.983306 -2.095687
C  -5.141396 0.33445 -0.302603
C  -5.503096 -1.050769 -2.394981
C  -6.133121 -0.498285 -1.117346
C  -2.102233 -1.800025 -0.67448
C  -2.69768 -0.040739 0.644639
H  3.778553 2.420512 -0.658107
H  1.790454 1.252827 -1.265157
H  3.461388 1.643748 -2.906718
H  4.993356 0.774063 -2.946573
H  3.492026 -0.068133 -3.327254
H  4.004585 -1.809991 -1.470594
H  5.506658 -0.953686 -1.148148
H  4.38194 -1.27644 0.161612
H  5.190589 0.619715 1.224586
H  -0.446538 -0.556321 1.943856
H  -0.022645 -1.986692 0.982964
H  3.987867 1.599015 4.283359
H  5.485796 1.144601 3.466897
H  5.131434 2.839486 3.816133
H  1.990101 2.57497 2.70339
H  3.104695 3.92396 2.671604
H  2.507357 3.242347 1.158888
H  -3.738259 -2.170838 -2.996264
H  -4.684507 -2.962686 -1.760489
H  -5.514658 0.505031 0.710133
H  -5.010329 1.327352 -0.745266
H  -5.153016 -0.220416 -3.015132
H  -6.252583 -1.584082 -2.981442
H  -6.49354 -1.328989 -0.50366
H  -7.00539 0.109474 -1.362176
elementType: O N C H
totalener: -1094.87769632 hartree
nucrepener: 2069.91987435 hartree
electener: -3164.79757067 hartree
oneelecener: -5602.29555899 hartree
twoeener: 2437.49798832 hartree
cpcmener: -0.03120755 hartree
kineticenergy: 1090.03208185 hartree
xcener: -105.968360123170 hartree
chargesum: 0.0000000
charge: -0.283134 -0.466016 -0.407690 -0.408174 -0.115266 0.130510 -0.029032 -0.087222 -0.262845 -0.296889 -0.256635 0.393436 -0.021110 0.089231 -0.226263 -0.269807 -0.066131 -0.078496 -0.071963 -0.073243 -0.135586 -0.135451 0.315878 0.322158 0.112046 0.091782 0.086480 0.093459 0.096331 0.101430 0.100399 0.094259 0.121420 0.133034 0.127116 0.094269 0.088286 0.094772 0.101830 0.102465 0.093221 0.093637 0.100074 0.094234 0.101382 0.078102 0.080865 0.078163 0.080688
qa: -0.2831 -0.4660 -0.4077 -0.4082 -0.1153 0.1305 -0.0290 -0.0872 -0.2628 -0.2969 -0.2566 0.3934 -0.0211 0.0892 -0.2263 -0.2698 -0.0661 -0.0785 -0.0720 -0.0732 -0.1356 -0.1355 0.3159 0.3222 0.1120 0.0918 0.0865 0.0935 0.0963 0.1014 0.1004 0.0943 0.1214 0.1330 0.1271 0.0943 0.0883 0.0948 0.1018 0.1025 0.0932 0.0936 0.1001 0.0942 0.1014 0.0781 0.0809 0.0782 0.0807
va: 2.1069 2.0218 2.1097 2.1099 3.1278 3.7510 3.8274 3.8582 3.9005 3.9004 3.8403 4.0793 3.7191 3.8926 3.9288 3.9454 3.6632 3.6783 3.9213 3.9224 3.9156 3.9146 4.2179 4.2163 1.0048 1.0293 1.0049 1.0023 1.0023 1.0006 0.9981 1.0154 0.9994 1.0016 1.0041 0.9956 1.0073 0.9967 0.9970 1.0004 1.0047 1.0154 1.0049 1.0150 1.0051 1.0069 1.0095 1.0069 1.0095
dispcorr: -0.022742388 hartree
energy: -1094.900438709134
dipole: 13.77817 -15.42257 -1.64439 9.82750 -9.19592 0.63158 -3.45497 2.16702 -1.28795
magnitude: 2.18214 au
magnitude: 5.54655 debye
