program: Orca
programVersion: 5.0.2
elementType: O O O O N C C C C C C C C C C C C C C C C C C C H H H H H H H H H H H H H H H H H H H H H H H H H
charge: 0
multiplicity: 1
keywords: wb97x-d3
keywords: def2-TZVPP
keywords: def2/J RIJCOSX
keywords: DEFGRID2
keywords: scfconv7
keywords: smallprint printgap noloewdin
keywords: NOSOSCF
formula: C19H25NO4
InChI: InChI=1/C19H25NO4/c1-11(2)9-14-15(19(14,3)4)18(23)24-10-20-16(21)12-7-5-6-8-13(12)17(20)22/h9,14-15H,5-8,10H2,1-4H3
49 atoms
O  0.741361 -1.731545 0.235076
O  1.823832 -0.351965 1.63219
O  -1.274338 0.639276 1.489139
O  -2.343905 -3.396743 -0.304607
N  -1.509623 -1.549475 0.798292
C  3.856436 0.05234 -0.66585
C  2.755953 1.012729 -0.977318
C  2.42422 -0.448559 -0.689409
C  4.703562 -0.418212 -1.825226
C  4.636164 0.159012 0.620548
C  2.319333 2.10362 -0.065916
C  1.673136 -0.804411 0.525409
C  2.997009 3.235607 0.139209
C  -0.24181 -2.063372 1.204749
C  2.456947 4.311272 1.032426
C  4.32084 3.537251 -0.49232
C  -3.192702 -0.090362 0.207227
C  -3.514354 -1.27872 -0.305769
C  -3.996648 1.147551 0.063335
C  -4.748035 -1.571533 -1.075682
C  -5.047466 0.944731 -1.030117
C  -5.735929 -0.41452 -0.913347
C  -1.896723 -0.218798 0.917641
C  -2.433169 -2.241124 0.020596
H  2.647951 1.249126 -2.033576
H  2.151224 -1.038052 -1.55661
H  5.140729 -1.397637 -1.620099
H  4.127999 -0.498845 -2.748493
H  5.524812 0.278693 -2.006351
H  4.08749 0.628591 1.431101
H  4.960783 -0.827087 0.959096
H  5.5357 0.753036 0.446477
H  1.353344 1.992735 0.417785
H  0.014856 -1.681758 2.19051
H  -0.302409 -3.148214 1.251566
H  2.306191 5.243679 0.481401
H  1.505667 4.030588 1.485082
H  3.15919 4.539548 1.838744
H  4.259262 4.451105 -1.090166
H  5.083219 3.721341 0.269276
H  4.680163 2.740443 -1.141583
H  -4.471411 1.386937 1.020433
H  -3.347575 1.995235 -0.169943
H  -4.49067 -1.719519 -2.129546
H  -5.190409 -2.512664 -0.739975
H  -5.786806 1.745326 -0.980104
H  -4.566606 1.023887 -2.009463
H  -6.525428 -0.500612 -1.661259
H  -6.221653 -0.490875 0.063903
elementType: O N C H
totalener: -1094.87545758 hartree
nucrepener: 2108.93156119 hartree
electener: -3203.80701877 hartree
oneelecener: -5680.63091220 hartree
twoeener: 2476.82389343 hartree
cpcmener: -0.03226238 hartree
kineticenergy: 1090.03173587 hartree
xcener: -105.969465112778 hartree
chargesum: 0.0000000
charge: -0.286925 -0.448065 -0.411042 -0.409945 -0.099508 0.090335 -0.011306 -0.078360 -0.267007 -0.294297 -0.257730 0.383531 -0.023313 0.079570 -0.228381 -0.265367 -0.055391 -0.084070 -0.073418 -0.073448 -0.134806 -0.135957 0.311857 0.325529 0.115014 0.095159 0.098122 0.087277 0.091838 0.101365 0.108598 0.093261 0.113927 0.136744 0.125590 0.094466 0.089822 0.093018 0.106083 0.099930 0.088918 0.100491 0.094302 0.101158 0.093946 0.080925 0.078414 0.081004 0.078143
qa: -0.2869 -0.4481 -0.4110 -0.4099 -0.0995 0.0903 -0.0113 -0.0784 -0.2670 -0.2943 -0.2577 0.3835 -0.0233 0.0796 -0.2284 -0.2654 -0.0554 -0.0841 -0.0734 -0.0734 -0.1348 -0.1360 0.3119 0.3255 0.1150 0.0952 0.0981 0.0873 0.0918 0.1014 0.1086 0.0933 0.1139 0.1367 0.1256 0.0945 0.0898 0.0930 0.1061 0.0999 0.0889 0.1005 0.0943 0.1012 0.0939 0.0809 0.0784 0.0810 0.0781
va: 2.1118 2.0498 2.1012 2.1078 3.0959 3.7035 3.8040 3.8483 3.9034 3.8860 3.8681 4.1216 3.7016 3.8866 3.9261 3.9331 3.6468 3.6937 3.9182 3.9205 3.9130 3.9136 4.2168 4.2206 1.0048 1.0288 1.0020 1.0048 1.0035 1.0164 1.0016 0.9988 1.0109 1.0175 1.0118 0.9959 1.0077 0.9970 1.0001 0.9965 1.0063 1.0051 1.0155 1.0054 1.0151 1.0097 1.0069 1.0095 1.0066
dispcorr: -0.024102316 hartree
energy: -1094.899559893683
dipole: 15.08340 -16.21381 -1.13041 20.06444 -19.44835 0.61609 -8.34846 6.90458 -1.44388
magnitude: 1.93448 au
magnitude: 4.91705 debye
