program: Orca
programVersion: 5.0.2
elementType: O O O O N C C C C C C C C C C C C C C C C C C C H H H H H H H H H H H H H H H H H H H H H H H H H
charge: 0
multiplicity: 1
keywords: wb97x-d3
keywords: def2-TZVPP
keywords: def2/J RIJCOSX
keywords: DEFGRID2
keywords: scfconv7
keywords: smallprint printgap noloewdin
keywords: NOSOSCF
formula: C19H25NO4
InChI: InChI=1/C19H25NO4/c1-11(2)9-14-15(19(14,3)4)18(23)24-10-20-16(21)12-7-5-6-8-13(12)17(20)22/h9,14-15H,5-8,10H2,1-4H3
49 atoms
O  0.539196 -0.445529 -0.594246
O  1.45792 1.589738 -0.798062
O  -1.692457 1.515522 0.682717
O  -2.437075 -2.341995 -1.597182
N  -1.77498 -0.319696 -0.704494
C  3.293698 0.780896 1.555307
C  3.968178 0.217819 0.35447
C  2.481463 -0.069132 0.594879
C  3.579227 0.115479 2.881633
C  3.055757 2.264926 1.687161
C  4.439915 1.059025 -0.77416
C  1.472111 0.484223 -0.318579
C  4.512771 0.655749 -2.044977
C  -0.563051 -0.099398 -1.420733
C  5.046871 1.551655 -3.120064
C  4.063182 -0.695963 -2.506429
C  -3.464116 -0.130799 0.848707
C  -3.687847 -1.254777 0.166692
C  -4.31157 0.380936 1.952907
C  -4.843459 -2.161037 0.369972
C  -5.272937 -0.718986 2.407547
C  -5.897986 -1.45442 1.223726
C  -2.229514 0.500341 0.320099
C  -2.597771 -1.431986 -0.825402
H  4.576439 -0.663623 0.542156
H  2.259317 -1.07252 0.938713
H  3.737346 -0.958704 2.775492
H  4.47704 0.53865 3.337002
H  2.752453 0.262282 3.579588
H  2.968003 2.787643 0.739434
H  2.14705 2.460481 2.259633
H  3.887447 2.715338 2.233006
H  4.778369 2.062344 -0.531649
H  -0.551289 -0.746394 -2.295967
H  -0.507783 0.936586 -1.747902
H  4.30926 1.69186 -3.914854
H  5.321044 2.535303 -2.738644
H  5.930502 1.115877 -3.594412
H  3.272909 -0.602842 -3.255251
H  4.882514 -1.232475 -2.990898
H  3.686163 -1.32396 -1.701866
H  -3.687909 0.722717 2.782296
H  -4.862868 1.26168 1.608801
H  -5.260296 -2.465446 -0.593046
H  -4.502878 -3.081591 0.854634
H  -4.731335 -1.434685 3.032651
H  -6.053334 -0.285996 3.034821
H  -6.444199 -0.739833 0.601436
H  -6.628996 -2.182717 1.57737
elementType: O N C H
totalener: -1094.87595838 hartree
nucrepener: 2094.81336560 hartree
electener: -3189.68932398 hartree
oneelecener: -5652.36920477 hartree
twoeener: 2462.67988079 hartree
cpcmener: -0.03236695 hartree
kineticenergy: 1090.05587274 hartree
xcener: -105.974514142818 hartree
chargesum: -0.0000000
charge: -0.291710 -0.452921 -0.410043 -0.410755 -0.096545 0.134270 -0.018492 -0.115757 -0.263802 -0.296939 -0.273113 0.404025 -0.013241 0.078483 -0.223266 -0.265555 -0.065107 -0.081209 -0.073035 -0.073148 -0.136273 -0.135131 0.316435 0.322387 0.112454 0.095910 0.086061 0.093607 0.095498 0.095978 0.101114 0.097665 0.118969 0.123306 0.138941 0.093612 0.088879 0.094912 0.098155 0.106351 0.091629 0.094313 0.100974 0.093149 0.101297 0.078189 0.081119 0.077927 0.080433
qa: -0.2917 -0.4529 -0.4100 -0.4108 -0.0965 0.1343 -0.0185 -0.1158 -0.2638 -0.2969 -0.2731 0.4040 -0.0132 0.0785 -0.2233 -0.2656 -0.0651 -0.0812 -0.0730 -0.0731 -0.1363 -0.1351 0.3164 0.3224 0.1125 0.0959 0.0861 0.0936 0.0955 0.0960 0.1011 0.0977 0.1190 0.1233 0.1389 0.0936 0.0889 0.0949 0.0982 0.1064 0.0916 0.0943 0.1010 0.0931 0.1013 0.0782 0.0811 0.0779 0.0804
va: 2.0934 2.0399 2.1077 2.1081 3.0970 3.7397 3.8326 3.8066 3.9025 3.8957 3.8635 4.0952 3.7108 3.8666 3.9253 3.9450 3.6635 3.6912 3.9221 3.9203 3.9145 3.9133 4.2264 4.2277 1.0051 1.0301 1.0046 1.0022 1.0024 1.0151 1.0015 0.9984 1.0025 1.0133 1.0185 0.9972 1.0071 0.9961 0.9988 0.9988 1.0071 1.0154 1.0049 1.0157 1.0053 1.0068 1.0094 1.0069 1.0095
dispcorr: -0.023445196 hartree
energy: -1094.899403579433
dipole: 15.20269 -16.27591 -1.07322 1.95787 -3.04340 -1.08553 6.08495 -5.08592 0.99903
magnitude: 1.82434 au
magnitude: 4.63711 debye
