program: Orca
programVersion: 5.0.2
elementType: O O O O N C C C C C C C C C C C C C C C C C C C H H H H H H H H H H H H H H H H H H H H H H H H H
charge: 0
multiplicity: 1
keywords: wb97x-d3
keywords: def2-TZVPP
keywords: def2/J RIJCOSX
keywords: DEFGRID2
keywords: scfconv7
keywords: smallprint printgap noloewdin
keywords: NOSOSCF
formula: C19H25NO4
InChI: InChI=1/C19H25NO4/c1-11(2)9-14-15(19(14,3)4)18(23)24-10-20-16(21)12-7-5-6-8-13(12)17(20)22/h9,14-15H,5-8,10H2,1-4H3
49 atoms
O  1.312093 -1.458888 0.209088
O  2.092069 -2.328569 -1.699849
O  -1.484857 -1.282934 2.402231
O  -1.023971 -1.018909 -2.107215
N  -1.009206 -1.470055 0.152472
C  3.979604 -0.02669 0.473393
C  3.036537 0.916227 -0.193862
C  3.231386 -0.494628 -0.763262
C  5.455725 0.208785 0.248003
C  3.69324 -0.5952 1.842046
C  1.775429 1.379076 0.430855
C  2.173102 -1.515129 -0.810097
C  0.843245 2.122494 -0.172944
C  0.157525 -2.28563 0.210251
C  -0.36278 2.604767 0.574764
C  0.893057 2.522753 -1.615345
C  -2.777587 -0.111488 0.724685
C  -2.642557 -0.030844 -0.599555
C  -3.804943 0.599646 1.522727
C  -3.485922 0.797771 -1.49481
C  -4.887943 1.144687 0.589955
C  -4.293219 1.792732 -0.658949
C  -1.714767 -1.000796 1.25465
C  -1.489379 -0.871129 -1.006295
H  3.514538 1.657448 -0.827951
H  3.83604 -0.5380 -1.661794
H  6.020912 -0.720138 0.348728
H  5.658351 0.614994 -0.743947
H  5.847125 0.916592 0.981686
H  2.63877 -0.692411 2.082465
H  4.147479 -1.582358 1.94747
H  4.140216 0.050166 2.60114
H  1.618374 1.124355 1.474018
H  0.149496 -2.846185 1.142465
H  0.162402 -2.984527 -0.623299
H  -0.424995 2.180749 1.577429
H  -0.350718 3.694272 0.672112
H  -1.283558 2.355985 0.042403
H  0.667086 3.584555 -1.736508
H  1.85359 2.327792 -2.089549
H  0.134441 1.978031 -2.185037
H  -4.234832 -0.067181 2.274053
H  -3.326683 1.412029 2.080637
H  -2.864532 1.316307 -2.229259
H  -4.150433 0.146071 -2.071503
H  -5.551913 0.327461 0.293458
H  -5.503944 1.866656 1.128005
H  -3.644584 2.621534 -0.360717
H  -5.087079 2.223398 -1.270926
elementType: O N C H
totalener: -1094.87315529 hartree
nucrepener: 2231.33395965 hartree
electener: -3326.20711494 hartree
oneelecener: -5924.61583637 hartree
twoeener: 2598.40872142 hartree
cpcmener: -0.03371370 hartree
kineticenergy: 1090.05062792 hartree
xcener: -105.976673570041 hartree
chargesum: -0.0000000
charge: -0.263432 -0.458353 -0.411190 -0.405035 -0.077795 0.137623 -0.043801 -0.130271 -0.262012 -0.285485 -0.235733 0.413203 -0.029260 0.061234 -0.228707 -0.261917 -0.101776 -0.034397 -0.073203 -0.074519 -0.131059 -0.146545 0.327893 0.271591 0.110886 0.091317 0.095864 0.086907 0.093342 0.087975 0.103666 0.098283 0.122690 0.124663 0.141705 0.092423 0.114353 0.061478 0.101344 0.092174 0.090986 0.097814 0.101862 0.097334 0.107004 0.077897 0.081163 0.083239 0.086577
qa: -0.2634 -0.4584 -0.4112 -0.4050 -0.0778 0.1376 -0.0438 -0.1303 -0.2620 -0.2855 -0.2357 0.4132 -0.0293 0.0612 -0.2287 -0.2619 -0.1018 -0.0344 -0.0732 -0.0745 -0.1311 -0.1465 0.3279 0.2716 0.1109 0.0913 0.0959 0.0869 0.0933 0.0880 0.1037 0.0983 0.1227 0.1247 0.1417 0.0924 0.1144 0.0615 0.1013 0.0922 0.0910 0.0978 0.1019 0.0973 0.1070 0.0779 0.0812 0.0832 0.0866
va: 2.0978 2.0551 2.1027 2.1032 3.0985 3.7653 3.7799 3.8548 3.8976 3.8999 3.8222 4.1519 3.6929 3.8692 3.9397 3.9460 3.6762 3.5717 3.9159 3.8941 3.9105 3.9112 4.1840 4.2107 1.0026 1.0287 1.0019 1.0056 1.0024 1.0161 0.9999 0.9994 1.0037 1.0135 1.0216 1.0082 0.9987 0.9960 0.9985 1.0083 1.0035 1.0162 1.0058 1.0147 1.0044 1.0070 1.0102 1.0030 1.0109
dispcorr: -0.028956216 hartree
energy: -1094.902111507446
dipole: 3.61876 -4.93380 -1.31505 20.34745 -18.50408 1.84338 3.18123 -2.37460 0.80663
magnitude: 2.40375 au
magnitude: 6.10986 debye
