program: Orca
programVersion: 5.0.2
elementType: O O O O N C C C C C C C C C C C C C C C C C C C H H H H H H H H H H H H H H H H H H H H H H H H H
charge: 0
multiplicity: 1
keywords: wb97x-d3
keywords: def2-TZVPP
keywords: def2/J RIJCOSX
keywords: DEFGRID2
keywords: scfconv7
keywords: smallprint printgap noloewdin
keywords: NOSOSCF
formula: C19H25NO4
InChI: InChI=1/C19H25NO4/c1-11(2)9-14-15(19(14,3)4)18(23)24-10-20-16(21)12-7-5-6-8-13(12)17(20)22/h9,14-15H,5-8,10H2,1-4H3
49 atoms
O  0.506322 -1.100266 0.06847
O  1.591967 -0.157918 -1.650977
O  -1.674315 0.767872 -1.312211
O  -2.452914 -3.202346 0.75641
N  -1.737662 -1.365359 -0.446277
C  2.48071 1.945065 0.465134
C  3.559585 0.910814 0.539224
C  2.092809 0.482543 0.610061
C  2.245385 2.784054 1.698733
C  2.225377 2.705136 -0.812607
C  4.442759 0.576191 -0.593562
C  1.411102 -0.258382 -0.463109
C  5.771959 0.430665 -0.531699
C  -0.411571 -1.769111 -0.784167
C  6.558021 0.095858 -1.764861
C  6.607052 0.580667 0.703815
C  -3.606314 -0.062633 -0.107573
C  -3.831162 -1.227893 0.501665
C  -4.561952 1.069876 -0.164814
C  -5.070718 -1.583206 1.234687
C  -5.95076 0.58623 0.257952
C  -5.89348 -0.318217 1.488683
C  -2.251436 -0.102051 -0.710667
C  -2.63535 -2.091731 0.327715
H  4.030374 0.83653 1.513049
H  1.761279 0.198303 1.601775
H  2.427901 2.223528 2.616668
H  2.907528 3.65261 1.703636
H  1.217261 3.150825 1.731963
H  2.487262 2.164948 -1.717584
H  1.174166 2.990561 -0.888628
H  2.81283 3.625661 -0.803578
H  3.978601 0.446983 -1.563814
H  -0.31904 -2.839899 -0.614626
H  -0.211407 -1.559031 -1.832747
H  7.303042 0.867907 -1.978776
H  7.11249 -0.837642 -1.63438
H  5.923258 -0.011134 -2.644972
H  7.341211 1.380977 0.572412
H  6.038702 0.805879 1.603987
H  7.180239 -0.330856 0.894471
H  -4.210872 1.870672 0.494817
H  -4.586094 1.498274 -1.169898
H  -5.642955 -2.306644 0.644356
H  -4.828661 -2.087388 2.173498
H  -6.592348 1.446197 0.45585
H  -6.40793 0.039131 -0.572007
H  -6.903127 -0.595763 1.795047
H  -5.453808 0.234272 2.324239
elementType: O N C H
totalener: -1094.87665350 hartree
nucrepener: 2068.12380696 hartree
electener: -3163.00046045 hartree
oneelecener: -5598.84368979 hartree
twoeener: 2435.84322934 hartree
cpcmener: -0.03108552 hartree
kineticenergy: 1090.01850948 hartree
xcener: -105.968646101214 hartree
chargesum: -0.0000000
charge: -0.288572 -0.455716 -0.412776 -0.410262 -0.095216 0.112347 0.031202 -0.108523 -0.263036 -0.283412 -0.290178 0.406358 -0.055794 0.078929 -0.218848 -0.254262 -0.060758 -0.077250 -0.074257 -0.072669 -0.134568 -0.135134 0.316046 0.319980 0.115329 0.096556 0.086591 0.094470 0.094071 0.097099 0.100403 0.097185 0.123998 0.123453 0.140375 0.092213 0.091883 0.088703 0.096284 0.087433 0.095191 0.101477 0.093294 0.100282 0.093458 0.080456 0.077937 0.080087 0.078139
qa: -0.2886 -0.4557 -0.4128 -0.4103 -0.0952 0.1123 0.0312 -0.1085 -0.2630 -0.2834 -0.2902 0.4064 -0.0558 0.0789 -0.2188 -0.2543 -0.0608 -0.0773 -0.0743 -0.0727 -0.1346 -0.1351 0.3160 0.3200 0.1153 0.0966 0.0866 0.0945 0.0941 0.0971 0.1004 0.0972 0.1240 0.1235 0.1404 0.0922 0.0919 0.0887 0.0963 0.0874 0.0952 0.1015 0.0933 0.1003 0.0935 0.0805 0.0779 0.0801 0.0781
va: 2.1057 2.0416 2.1020 2.1089 3.0914 3.7035 3.7471 3.8612 3.9120 3.9078 3.8549 4.0995 3.7852 3.8686 3.9223 3.9390 3.6587 3.6933 3.9217 3.9188 3.9143 3.9162 4.2224 4.2251 1.0035 1.0298 1.0054 1.0017 1.0022 1.0131 1.0023 1.0014 1.0232 1.0147 1.0158 0.9964 0.9964 1.0090 0.9969 1.0142 0.9970 1.0048 1.0153 1.0048 1.0157 1.0096 1.0066 1.0095 1.0065
dispcorr: -0.022414355 hartree
energy: -1094.899067850379
dipole: 17.34653 -18.63615 -1.28961 16.05143 -15.39694 0.65449 5.29976 -3.94551 1.35425
magnitude: 1.98128 au
magnitude: 5.03600 debye
